{"text_format":"1","workbook":"xlsx","n_sheets":10,"sheets":["Doucment Allocation","logistics","AllDocs","TP","REQ","ARC","PRO","SEC","MAS","TST"],"not_rendered":{"charts":0,"images":1,"macros":1,"external_links":0,"defined_names":14,"comments":0,"pivot_tables":0},"unopened":[],"bounds":{"document_bytes":16777216,"sheet_cells":100000,"rows_first":2000,"rows_last":500,"rows_between":2000,"halvings":0,"cell_chars":16384,"cell_head_chars":4096},"cells_cut":0,"cells_raw":0,"read":"whole","date_system":"1900"}

{"sheet":"Doucment Allocation","index":0,"n_rows":98,"n_cols":13,"rows_kept":98,"cut":false,"hidden":false,"merged":[]}
["Slot","Room","WG","Doc-Number","Title","Source","Upload Time","WG disposition (Agreed, Noted, Postponed, Withdrawn)","Type (INC, CR, AG, MIN)","Work Item","Rel","Purpose","Notes"]
["Day1-2 (11:30-13:00)",{"$f":"VLOOKUP(A2,logistics!G:I,2,0)","v":"Main"},{"$f":"VLOOKUP(A2,logistics!G:I,3,0)","v":"MAS"},"MAS-2015-0573","Agenda MAS#17","Yongjing Zhang (Huawei, Chair)",{"$f":"VLOOKUP(D2,AllDocs!A:D,4,0)","v":"2015-05-14T09:11:03"},"Noted","AG",null,null,"Decision"]
["Day1-2 (11:30-13:00)",{"$f":"VLOOKUP(A3,logistics!G:I,2,0)","v":"Main"},{"$f":"VLOOKUP(A3,logistics!G:I,3,0)","v":"MAS"},"MAS-2015-0573R01","Agenda MAS#17","Yongjing Zhang (Huawei, Chair)",{"$f":"VLOOKUP(D3,AllDocs!A:D,4,0)","v":"2015-05-18T04:02:36"},"Agreed","AG",null,null,"Decision"]
["Day1-2 (11:30-13:00)",{"$f":"VLOOKUP(A4,logistics!G:I,2,0)","v":"Main"},{"$f":"VLOOKUP(A4,logistics!G:I,3,0)","v":"MAS"},"MAS-2015-0574","MAS#17 Document Allocation","Yongjing Zhang (Huawei, Chair)",{"$f":"VLOOKUP(D4,AllDocs!A:D,4,0)","v":"2015-05-14T09:10:42"},"Noted","AG",null,null,"Decision"]
["Day1-2 (11:30-13:00)",{"$f":"VLOOKUP(A5,logistics!G:I,2,0)","v":"Main"},{"$f":"VLOOKUP(A5,logistics!G:I,3,0)","v":"MAS"},"MAS-2015-0574R01","MAS#17 Document Allocation","Yongjing Zhang (Huawei, Chair)",{"$f":"VLOOKUP(D5,AllDocs!A:D,4,0)","v":"2015-05-18T10:24:32"},"Noted","AG",null,null,"Decision"]
["Day1-2 (11:30-13:00)",{"$f":"VLOOKUP(A6,logistics!G:I,2,0)","v":"Main"},{"$f":"VLOOKUP(A6,logistics!G:I,3,0)","v":"MAS"},"MAS-2015-0567","TR0007 sec8_4_1","InterDigital",{"$f":"VLOOKUP(D6,AllDocs!A:D,4,0)","v":"2015-05-10T17:25:34"},"Noted","CR","TR-0007 (WI-0005)",2,"Decision","R01 expected"]
["Day1-2 (11:30-13:00)",{"$f":"VLOOKUP(A7,logistics!G:I,2,0)","v":"Main"},{"$f":"VLOOKUP(A7,logistics!G:I,3,0)","v":"MAS"},"MAS-2015-0569","oneM2M_architecture_semantics","Modacom",{"$f":"VLOOKUP(D7,AllDocs!A:D,4,0)","v":"2015-05-10T18:04:32"},"Noted","INC","TR-0007 (WI-0005)",2,"Decision","driving' -> 'deriving'\n"]
["Day1-2 (11:30-13:00)",{"$f":"VLOOKUP(A8,logistics!G:I,2,0)","v":"Main"},{"$f":"VLOOKUP(A8,logistics!G:I,3,0)","v":"MAS"},"MAS-2015-0570","semnatics_data_analytics","Modacom",{"$f":"VLOOKUP(D8,AllDocs!A:D,4,0)","v":"2015-05-10T18:06:32"},"Noted","INC","TR-0007 (WI-0005)",2,"Decision","R01 expected"]
["Day1-2 (11:30-13:00)",{"$f":"VLOOKUP(A9,logistics!G:I,2,0)","v":"Main"},{"$f":"VLOOKUP(A9,logistics!G:I,3,0)","v":"MAS"},"ARC-2015-1844","semanticDescriptor resource","Omar Elloumi, ALU (ATIS), Martin Bauer NEC Europe Ltd. (ETSI)  Joerg Swetina, NEC Europe Ltd. (ETSI)  Ataru Kobayashi, NEC Corporation (TTC)  Mahdi Ben Alaya, LAAS-CNRS (ETSI)  Khalil Drira, LAAS-CNRS (ETSI)",{"$f":"VLOOKUP(D9,AllDocs!A:D,4,0)","v":"2015-05-10T11:19:19"},"Noted","CR","TS-0001 (WI-0002)",2,"Decision","Editorial changes needed.\nCommon descriptor for multiple resources is ffs.\nmultiple descriptor should be possible\n"]
["Day1-2 (11:30-13:00)",{"$f":"VLOOKUP(A10,logistics!G:I,2,0)","v":"Main"},{"$f":"VLOOKUP(A10,logistics!G:I,3,0)","v":"MAS"},"MAS-2015-0564","oneM2M base ontology proposal","Omar Elloumi Alcatel-Lucent (ATIS),  Mahdi Ben Alaya LAAS-CNRS (ETSI),  Khalil Drira LAAS-CNRS (ETSI)",{"$f":"VLOOKUP(D10,AllDocs!A:D,4,0)","v":"2015-05-10T11:39:12"},"Draft","INC","TS-0012 (WI-0025)",2,"Decision","KEEP OPEN for further discussion"]
["Day1-3 (14:30-16:00)",{"$f":"VLOOKUP(A11,logistics!G:I,2,0)","v":"Adhoc"},{"$f":"VLOOKUP(A11,logistics!G:I,3,0)","v":"MAS"},"MAS-2015-0568","Ontology Management Considerrations","InterDigital",{"$f":"VLOOKUP(D11,AllDocs!A:D,4,0)","v":"00:00:00"},"Draft","INC","TR-0007 (WI-0005)",2,"Discussion","Skipped"]
["Day1-3 (14:30-16:00)",{"$f":"VLOOKUP(A12,logistics!G:I,2,0)","v":"Adhoc"},{"$f":"VLOOKUP(A12,logistics!G:I,3,0)","v":"MAS"},"MAS-2015-0568R01","Ontology Architectural Support Considerrations","InterDigital",{"$f":"VLOOKUP(D12,AllDocs!A:D,4,0)","v":"2015-05-10T17:25:58"},"Draft","INC","TR-0007 (WI-0005)",2,"Discussion","Skipped"]
["Day1-3 (14:30-16:00)",{"$f":"VLOOKUP(A13,logistics!G:I,2,0)","v":"Adhoc"},{"$f":"VLOOKUP(A13,logistics!G:I,3,0)","v":"MAS"},"MAS-2015-0568R02","Ontology Architectural Support Considerrations","InterDigital",{"$f":"VLOOKUP(D13,AllDocs!A:D,4,0)","v":"2015-05-18T05:34:32"},"Draft","INC","TR-0007 (WI-0005)",2,"Discussion","Subscription base on semantic rules as filter criteria is of interest.\nThe creator of semantic descriptor is flexible. (could be device AE, or proxy AE, or other AE)\nSlide 5: triple store and semantic engine could be in MN-CSE or IN-CSE. \nTriple store design is implementation specific.\nontologyRef may not be accessible, so oneM2M should be ale to locally store and manage ontologies as resources via Mca,Mcc. \nCaching may be needed as well. Details of (automatic) caching is FFS.\nThere should be a way to link ontolgoyRef and the oneM2M <ontology> resource."]
["Day1-3 (14:30-16:00)",{"$f":"VLOOKUP(A14,logistics!G:I,2,0)","v":"Adhoc"},{"$f":"VLOOKUP(A14,logistics!G:I,3,0)","v":"MAS"},"MAS-2015-0578","SemanticDiscoveryApproach","NEC",{"$f":"VLOOKUP(D14,AllDocs!A:D,4,0)","v":"2015-05-18T00:02:46"},"Draft","INC","TR-0007 (WI-0005)",2,"Discussion","Why not directly open SPARQL HTTP endpoint intead of multi-step approach via oneM2M resource interfaces? -Because of access right concerns?\n"]
["Day2-2 (09:30-11:00)",{"$f":"VLOOKUP(A15,logistics!G:I,2,0)","v":"Adhoc"},{"$f":"VLOOKUP(A15,logistics!G:I,3,0)","v":"MAS"},"MAS-2015-0560","components of the base ontology","China Unicom",{"$f":"VLOOKUP(D15,AllDocs!A:D,4,0)","v":"2015-05-08T06:49:09"},"Draft","CR","TS-0012 (WI-0025)",2,"Decision","Skipped"]
{"$rows_left_out":84}
{"sheet":"logistics","index":1,"n_rows":25,"n_cols":12,"rows_kept":25,"cut":false,"hidden":false,"merged":[]}
["WeekDay","SlotTime","Day","Slot","Time","AllSlots","MAS Slots","Rooms","WGs","WIs","Short Name","Deadline (GMT)"]
["Day1","09:00-11:00","Day1",1,"09:00-11:00",{"$f":"CONCATENATE(C2,\"-\",D2,\" (\",E2,\")\")","v":"Day1-1 (09:00-11:00)"},null,null,null,"TR-0001 (WI-0015)","Use Case Continuation","2015-05-11"]
["Day2","11:00-11:30","Day1",2,"11:30-13:00",{"$f":"CONCATENATE(C3,\"-\",D3,\" (\",E3,\")\")","v":"Day1-2 (11:30-13:00)"},"Day1-2 (11:30-13:00)","Main","MAS","TR-0007 (WI-0005)","Semantic Study"]
["Day3","11:30-13:00","Day1",3,"14:30-16:00","Day1-3 (14:30-16:00)","Day1-3 (14:30-16:00)","Adhoc","MAS","TR-0014 (WI-0018)","oneM2M AllJoyn Interworking"]
["Day4","13:00-14:30","Day1",4,"16:30-18:00",{"$f":"CONCATENATE(C5,\"-\",D5,\" (\",E5,\")\")","v":"Day1-4 (16:30-18:00)"},null,null,null,"TR-0017 (WI-0017)","Home Domain Abstract Information Model"]
["Day5","14:30-16:00","Day2",1,"08:00-09:30","Day2-1 (08:00-09:30)",null,null,null,"TS-0001 (WI-0002)","Architecture"]
[null,"16:00-16:30","Day2",2,"09:30-11:00","Day2-2 (09:30-11:00)","Day2-2 (09:30-11:00)","Adhoc","MAS","TS-0002 (WI-0001)","Requirement"]
[null,"16:30-18:00","Day2",3,"11:30-13:00","Day2-3 (11:30-13:00)","Day2-3 (11:30-13:00)","Breakout","MAS","TS-0004 (WI-0009)","Protocol Core"]
[null,null,"Day2",4,"14:30-16:00","Day2-4 (14:30-16:00)",null,null,null,"TS-0005 (WI-0010)","OMA Mapping"]
[null,null,"Day2",5,"16:30-18:00","Day2-5 (16:30-18:00)","Day2-5 (16:30-18:00)","Breakout","MAS","TS-0006 (WI-0010)","BBF Mapping"]
[null,"08:00-09:30","Day3",1,"08:00-09:30","Day3-1 (08:00-09:30)",null,null,null,"TS-0007 (WI-0011)","SOA Architecture"]
[null,"09:30-11:00","Day3",2,"09:30-11:00","Day3-2 (09:30-11:00)","Day3-2 (09:30-11:00)","Main","PRO/MAS","TS-0012 (WI-0025)","oneM2M Base Ontology"]
[null,"11:00-11:30","Day3",3,"11:30-13:00","Day3-3 (11:30-13:00)","Day3-3 (11:30-13:00)","Breakout","MAS","TS-0014 (WI-0024)","LWM2M_Interworking"]
[null,"11:30-13:00","Day3",4,"14:30-16:00","Day3-4 (14:30-16:00)","Day3-4 (14:30-16:00)","Adhoc","MAS"]
[null,"13:00-14:30","Day3",5,"16:30-18:00","Day3-5 (16:30-18:00)"]
{"$rows_left_out":11}
{"sheet":"AllDocs","index":2,"n_rows":276,"n_cols":8,"rows_kept":276,"cut":false,"hidden":false,"merged":[]}
[]
["TP-2015-0682R05","TP17 timeslot schedule initial","TP leadership","2015-05-18T08:40:02","Draft","INC",null,"TP 17"]
["ARC-2015-1793R01","App-ID format","FUJITSU","2015-05-10T23:24:49","Draft","CR",null,"ARC 17"]
["ARC-2015-1829","TS-0014-LWM2M_Object_Subscription","Tim Carey, ALU, timothy.carey@alcatel-lucent.com","2015-04-04T00:59:09","Draft","INC",null,"ARC 17"]
["ARC-2015-1829R01","TS-0014-LWM2M_Object_Subscription","Tim Carey, ALU, timothy.carey@alcatel-lucent.com","2015-04-09T17:54:53","Draft","INC",null,"ARC 17"]
["ARC-2015-1829R02","TS-0014-LWM2M_Object_Subscription","Tim Carey, ALU, timothy.carey@alcatel-lucent.com","2015-04-13T17:25:18","Draft","INC",null,"ARC 17"]
["ARC-2015-1835R01","CR resourceStatus","LG Electronics","2015-04-24T01:13:40","Draft","CR",null,"ARC 17"]
["ARC-2015-1835R02","CR resourceStatus","LG Electronics","2015-05-13T02:55:21","Draft","CR",null,"ARC 17"]
["ARC-2015-1843","TS-0007-Service_Components-V0_8_1_Draft-Baseline","ALU (TIA)","2015-05-06T13:11:45","Draft","INC",null,"ARC 17"]
["ARC-2015-1844","semanticDescriptor resource","Omar Elloumi, ALU (ATIS), Martin Bauer NEC Europe Ltd. (ETSI)  Joerg Swetina, NEC Europe Ltd. (ETSI)  Ataru Kobayashi, NEC Corporation (TTC)  Mahdi Ben Alaya, LAAS-CNRS (ETSI)  Khalil Drira, LAAS-CNRS (ETSI)","2015-05-10T11:19:19","Draft","CR",null,"ARC 17"]
["ARC-2015-1845","CR for locationPolicy Procedures","LG Electronics","2015-05-07T12:19:18","Draft","CR",null,"ARC 17"]
["ARC-2015-1848","Discussion paper for interworking with 3GPP R13 MTC","AT&T; Intel Corporation","2015-05-07T19:14:23","Draft","AG",null,"ARC 17"]
["ARC-2015-1849","CR to TS 0001 for 3GPP Interface update","AT&T, Intel Corperation","2015-05-07T19:18:01","Draft","AG",null,"ARC 17"]
["ARC-2015-1850","locationUpdatePeriod UPDATE","ZTE","2015-05-08T07:28:42","Draft","CR",null,"ARC 17"]
["ARC-2015-1851","CR container clarification","LG Electronics","2015-05-08T09:11:29","Draft","CR",null,"ARC 17"]
{"$rows_left_out":262}
{"sheet":"TP","index":3,"n_rows":34,"n_cols":8,"rows_kept":34,"cut":false,"hidden":false,"merged":[]}
["SHORT DOC NB","SHORTNAME","SOURCE","UPLOADED","STATUS","DOC TYPE","VERS","MEETING"]
["TP-2015-0682R05","TP17 timeslot schedule initial","TP leadership","2015-05-18T08:40:02","Draft","INC",null,"TP 17"]
["TP-2015-0689R01","WPM status report at TP17 opening","Roland Hechwartner, WPM convenor","2015-05-18T07:06:24","Draft","STR",null,"TP 17"]
["TP-2015-0682R04","TP17 timeslot schedule initial","TP leadership","2015-05-18T06:37:30","Draft","INC",null,"TP 17"]
["TP-2015-0675R04","Agenda TP17","Omar Elloumi, TP Chair, ALU (ATIS)","2015-05-18T02:09:32","Draft","AG",null,"TP 17"]
["TP-2015-0679R01","oneM2M_Interop_Test_Event_Announcement","Jiaxin Yin, TST VC, Huawei Technologies Co., Ltd.","2015-05-18T01:12:50","Draft","INC",null,"TP 17"]
["TP-2015-0675R03","Agenda TP17","Omar Elloumi, TP Chair, ALU (ATIS)","2015-05-18T00:49:36","Draft","AG",null,"TP 17"]
["TP-2015-0690","Mow report at TP17","MoW convenor  (Enrico Scarrone)","2015-05-17T21:11:54","Noted","STR",null,"TP 17"]
["TP-2015-0691","Draft MoW 1.2.0","MoW (Enrico Scarrone, MoW convenor)","2015-05-17T20:39:17","Draft","INC",null,"TP 17"]
["TP-2015-0675R02","Agenda TP17","Omar Elloumi, TP Chair, ALU (ATIS)","2015-05-17T12:03:45","Noted","AG",null,"TP 17"]
["TP-2015-0689","WPM status report at TP17 opening","Roland Hechwartner, WPM convenor","2015-05-15T19:08:38","Draft","STR",null,"TP 17"]
["TP-2015-0682R03","TP17 timeslot schedule initial","TP leadership","2015-05-15T11:25:02","Noted","INC",null,"TP 17"]
["TP-2015-0687","Work_Item_Service_Component_Protocol","ZTE Corporation, AT&T","2015-05-14T05:10:39","Noted","CR",null,"TP 17"]
["TP-2015-0686","Work Item Supporting Time Series Data","Huawei Technologies, Hitachi , Haier, China Unicom, China academy of information and communications technology","2015-05-14T02:42:33","Agreed","INC",null,"TP 17"]
["TP-2015-0685","TR-0019 Dynamic Authorization v0_0_1","Rapporteur for Dynamic Authorization TR","2015-05-14T01:51:44","Draft","INC",null,"TP 17"]
{"$rows_left_out":20}
{"sheet":"REQ","index":4,"n_rows":18,"n_cols":8,"rows_kept":18,"cut":false,"hidden":false,"merged":[]}
["SHORT DOC NB","SHORTNAME","SOURCE","UPLOADED","STATUS","DOC TYPE","VERS","MEETING"]
["REQ-2015-0566","WG1 Document Allocation","Shelby Kiewel","2015-05-16T22:16:07","Draft","AG",null,"REQ 17"]
["REQ-2015-0565","direct_communication_CSEs_requirements","LG Electronics","2015-05-12T12:50:31","Draft","CR",null,"REQ 17"]
["REQ-2015-0564","Requirements for Efficient Communications","Nicolas Damour, Sierra Wireless","2015-05-11T09:10:37","Draft","INC",null,"REQ 17"]
["REQ-2015-0563","pCR_on_smart_meter_reading","China Mobile","2015-05-11T04:16:05","Draft","INC",null,"REQ 17"]
["REQ-2015-0562","Aircraft_Construction_and_Maintenance","Hitachi and InterDigital","2015-05-10T17:40:56","Draft","INC",null,"REQ 17"]
["REQ-2015-0561","Use case for group registration","InterDigital","2015-05-10T17:25:13","Draft","INC",null,"REQ 17"]
["REQ-2015-0560","3GPP coverage of oneM2M requirements.","InterDigital, Intel","2015-05-10T17:23:37","Draft","INC",null,"REQ 17"]
["REQ-2015-0559","requirements_on_ETC","Yingjie Hong,","2015-05-10T15:35:18","Draft","AG",null,"REQ 17"]
["REQ-2015-0558","group_requirements","Huawei Technologies Co., Ltd.","2015-05-10T15:31:58","Draft","CR",null,"REQ 17"]
["REQ-2015-0557","Use_Case_multicast_using_group","Huawei Technologies Co., Ltd.","2015-05-10T15:31:18","Draft","CR",null,"REQ 17"]
["REQ-2015-0556","Use_Case_access_control_using_group","Huawei Technologies Co., Ltd.","2015-05-10T15:30:34","Draft","CR",null,"REQ 17"]
["REQ-2015-0554","Smart_Automatic_Driving","Hitachi","2015-05-08T09:30:43","Draft","INC",null,"REQ 17"]
["REQ-2015-0553","Requirements to support on-demand data collection for factories","Hitachi","2015-05-08T09:15:42","Draft","CR",null,"REQ 17"]
["REQ-2015-0552","Data Process for Inter-factory manufacturing","Hitachi","2015-05-08T09:02:54","Draft","INC",null,"REQ 17"]
{"$rows_left_out":4}
{"sheet":"ARC","index":5,"n_rows":84,"n_cols":8,"rows_kept":84,"cut":false,"hidden":false,"merged":[]}
["SHORT DOC NB","SHORTNAME","SOURCE","UPLOADED","STATUS","DOC TYPE","VERS","MEETING"]
["ARC-2015-1887R01","CSE Registration procedure Release2","KT","2015-05-17T09:15:50","Draft","CR",null,"ARC 17"]
["ARC-2015-1886R01","CSE Registration procedure Release1","KT","2015-05-17T09:12:52","Draft","CR",null,"ARC 17"]
["ARC-2015-1885R01","RETRIEVE Release2","KT","2015-05-17T09:10:07","Draft","CR",null,"ARC 17"]
["ARC-2015-1884R01","RETRIEVE Release1","KT","2015-05-17T09:08:39","Draft","CR",null,"ARC 17"]
["ARC-2015-1883R01","Non-registration related CREATE procedure Release2","KT","2015-05-17T09:06:51","Draft","CR",null,"ARC 17"]
["ARC-2015-1882R01","Non-registration related CREATE procedure Release1","KT","2015-05-17T08:59:47","Draft","CR",null,"ARC 17"]
["ARC-2015-1908R01","CR for result content parameter clarification","KETI","2015-05-15T05:15:06","Draft","CR",null,"ARC 17"]
["ARC-2015-1898R01","App-ID Use Cases, Syntax and Attributes","Darold Hemphill (iconectiv)","2015-05-14T16:07:22","Draft","CR",null,"ARC 17"]
["ARC-2015-1897R01","App-ID Use Cases, Syntax and Attributes","Darold Hemphill (iconectiv)","2015-05-14T16:06:35","Draft","CR",null,"ARC 17"]
["ARC-2015-1908","CR for result content parameter clarification","KETI","2015-05-14T15:49:42","Draft","INC",null,"ARC 17"]
["ARC-2015-1907","CR AE child resource removal from remoteCSE resource(R2)","LG Electronics","2015-05-14T09:05:30","Draft","CR",null,"ARC 17"]
["ARC-2015-1906","CR AE child resource removal from remoteCSE resource","LG Electronics","2015-05-14T09:05:11","Draft","CR",null,"ARC 17"]
["ARC-2015-1905","CR result content parameter default value for delete operation","LG Electronics","2015-05-14T09:04:44","Draft","CR",null,"ARC 17"]
["ARC-2015-1835R02","CR resourceStatus","LG Electronics","2015-05-13T02:55:21","Draft","CR",null,"ARC 17"]
{"$rows_left_out":70}
{"sheet":"PRO","index":6,"n_rows":45,"n_cols":8,"rows_kept":45,"cut":false,"hidden":false,"merged":[]}
["SHORT DOC NB","SHORTNAME","SOURCE","UPLOADED","STATUS","DOC TYPE","VERS","MEETING"]
["PRO-2015-0791R01","Agenda WG3/PRO","WG3/PRO Chairman","2015-05-17T08:55:47","Draft","AG",null,"PRO 17"]
["PRO-2015-0798","Add Representation in NotificationEvent","LG Electronics","2015-05-15T09:15:15","Draft","CR",null,"PRO 17"]
["PRO-2015-0797","CR for partial retrieve request cases","KETI","2015-05-15T05:13:07","Draft","CR",null,"PRO 17"]
["PRO-2015-0791","Agenda WG3/PRO","WG3/PRO Chairman","2015-05-14T10:13:24","Draft","AG",null,"PRO 17"]
["PRO-2015-0796","CR AE child resource removal from remoteCSE resource","LG Electronics","2015-05-14T09:06:17","Draft","CR",null,"PRO 17"]
["PRO-2015-0764","AE_Resource_Type_XSD_Correction","LG Electronics","2015-05-14T03:38:08","Draft","CR",null,"PRO 17"]
["PRO-2015-0763R01","FilterUsage Correction","LG Electronics","2015-05-14T03:37:15","Draft","CR",null,"PRO 17"]
["PRO-2015-0795","CR for Response Type Info","LG Electronics","2015-05-13T02:41:11","Draft","CR",null,"PRO 17"]
["PRO-2015-0794","ShortName_for_groupID","LG Electronics","2015-05-13T02:17:20","Draft","CR",null,"PRO 17"]
["PRO-2015-0793","ShortName for oldest","LG Electronics","2015-05-13T02:04:57","Draft","CR",null,"PRO 17"]
["PRO-2015-0792","Virtual_Resource_XSD_Correction","LG Electronics","2015-05-13T01:56:23","Draft","CR",null,"PRO 17"]
["PRO-2015-0790","TS-0004-XSD-ACP_related_corrections","Qualcomm, IBM","2015-05-11T20:14:13","Draft","CR",null,"PRO 17"]
["PRO-2015-0789","CR_Name_parameter_data_type","LG Electronics","2015-05-11T07:33:02","Draft","CR",null,"PRO 17"]
["PRO-2015-0788","CR_MQTT_response_originator_receiver","LG Electronics","2015-05-11T07:32:45","Draft","CR",null,"PRO 17"]
{"$rows_left_out":31}
{"sheet":"SEC","index":7,"n_rows":24,"n_cols":8,"rows_kept":24,"cut":false,"hidden":false,"merged":[]}
["SHORT DOC NB","SHORTNAME","SOURCE","UPLOADED","STATUS","DOC TYPE","VERS","MEETING"]
["SEC-2015-0527","Security Requirements for WI-0016","Datang","2015-05-15T10:27:08","Draft","INC",null,"SEC 17"]
["SEC-2015-0517R01","Draft_CR_TS-0002_Security_Requirements_for_Release 2","China Mobile","2015-05-15T08:20:17","Draft","INC",null,"SEC 17"]
["SEC-2015-0516R01","Group_Authentication_Architecture","China Mobile","2015-05-15T03:45:00","Draft","INC",null,"SEC 17"]
["SEC-2015-0526","TR-0019 Dynamic Authorization Scope","Qualcomm Inc. (TIA) - Rapporteur","2015-05-14T02:00:54","Draft","CR",null,"SEC 17"]
["SEC-2015-0524","SEC 17 Agenda","WG Chair","2015-05-13T19:53:49","Draft","AG",null,"SEC 17"]
["SEC-2015-0522R01","Requirement SE Abstraction API","Giesecke & Devrient","2015-05-13T14:50:26","Draft","INC",null,"SEC 17"]
["SEC-2015-0521R01","WI-proposal TR-0008 Release 2","Giesecke & Devrient","2015-05-13T14:47:41","Draft","INC",null,"SEC 17"]
["SEC-2015-0520R01","PPM and oneM2M","KDDI Corporation","2015-05-12T13:09:03","Draft","INC",null,"SEC 17"]
["SEC-2015-0520","PPM and oneM2M","KDDI Corporation","2015-05-11T07:12:46","Draft","INC",null,"SEC 17"]
["SEC-2015-0519","TR-0016 Resource Definition for Supporting User-Defined ACP","Datang","2015-05-11T03:47:30","Draft","INC",null,"SEC 17"]
["SEC-2015-0518","A Solution of Supporting User-Defined Access Control Policies","Datang","2015-05-11T03:29:20","Draft","INC",null,"SEC 17"]
["SEC-2015-0517","Draft_CR_TS-0002_Security_Requirements_for_Release 2","China Mobile","2015-05-11T03:04:13","Draft","INC",null,"SEC 17"]
["SEC-2015-0516","Group_Authentication_Architecture","China Mobile","2015-05-11T02:59:23","Draft","INC",null,"SEC 17"]
["SEC-2015-0515","Security Requirements for WI-0023","Datang","2015-05-11T02:37:05","Draft","INC",null,"SEC 17"]
{"$rows_left_out":10}
{"sheet":"MAS","index":8,"n_rows":51,"n_cols":8,"rows_kept":51,"cut":false,"hidden":false,"merged":[]}
["SHORT DOC NB","SHORTNAME","SOURCE","UPLOADED","STATUS","DOC TYPE","VERS","MEETING"]
["MAS-2015-0572R02","Extension to Device Sets on TR-0017","NTT","2015-05-19T09:27:28","Draft","CR",null,"MAS 17"]
["MAS-2015-0571R03","Analysis from ECHONET on TR-0017","NTT","2015-05-19T09:27:03","Draft","CR",null,"MAS 17"]
["MAS-2015-0571R02","Analysis from ECHONET on TR-0017","NTT","2015-05-19T09:23:34","Draft","CR",null,"MAS 17"]
["MAS-2015-0575R02","Clarification_of_abstract_information_model_Approach_1","LG Electronics","2015-05-19T08:56:20","Draft","CR",null,"MAS 17"]
["MAS-2015-0580","Align Resource Names and Attributes","ALU (TIA)","2015-05-19T08:17:15","Draft","CR",null,"MAS 17"]
["MAS-2015-0555R02","TS-0005-LWM2M-V1_0_1_Fix","Gemalto N.V","2015-05-19T06:44:57","Draft","CR",null,"MAS 17"]
["MAS-2015-0550R01","Update TS-0006 XML namespace","ALU (TIA)","2015-05-19T04:40:06","Draft","CR",null,"MAS 17"]
["MAS-2015-0572R01","Extension to Device Sets on TR-0017","NTT","2015-05-19T04:35:00","Draft","CR",null,"MAS 17"]
["MAS-2015-0558R01","Device Management related Questions to oneM2M","ORANGE (ETSI)","2015-05-19T03:38:18","Draft","INC",null,"MAS 17"]
["MAS-2015-0579","LS answer to ITU-T SG17 on the use of OID for IoT","KETI, WG2,5","2015-05-19T01:43:14","Draft","LS",null,"MAS 17"]
["MAS-2015-0571R01","Analysis from ECHONET on TR-0017","NTT","2015-05-19T00:39:20","Draft","CR",null,"MAS 17"]
["MAS-2015-0574R01","MAS#17 Document Allocation","Yongjing Zhang (Huawei, Chair)","2015-05-18T10:24:32","Draft","AG",null,"MAS 17"]
["MAS-2015-0569R01","oneM2M_architecture_semantics","Modacom","2015-05-18T06:48:30","Draft","INC",null,"MAS 17"]
["MAS-2015-0570R01","semnatics_data_analytics","Modacom","2015-05-18T06:46:57","Draft","INC",null,"MAS 17"]
{"$rows_left_out":37}
{"sheet":"TST","index":9,"n_rows":26,"n_cols":8,"rows_kept":26,"cut":false,"hidden":false,"merged":[]}
["SHORT DOC NB","SHORTNAME","SOURCE","UPLOADED","STATUS","DOC TYPE","VERS","MEETING"]
["TST-2015-0098R01","TST-17-Agenda","WG6 Chair","2015-05-17T07:49:39","Draft","AG",null,"TST 17"]
["TST-2015-0099R02","TST_17_docs_allocation","WG6 Chair","2015-05-17T07:48:58","Draft","AG",null,"TST 17"]
["TST-2015-0100","ICS-ICS Proforma Annex","KETI","2015-05-15T08:23:46","Draft","INC",null,"TST 17"]
["TST-2015-0099R01","TST_17_docs_allocation","WG6 Chair","2015-05-15T04:28:21","Draft","AG",null,"TST 17"]
["TST-2015-0098","TST-17-Agenda","WG6 Chair","2015-05-15T04:27:48","Draft","AG",null,"TST 17"]
["TST-2015-0099","TST_17_docs_allocation","WG6 Chair","2015-05-15T01:58:39","Draft","AG",null,"TST 17"]
["TST-2015-0096R01","TS-0013 MQTT binding messages","LG Electronics","2015-05-14T09:13:57","Draft","INC",null,"TST 17"]
["TST-2015-0093R01","TS-0013_update_of_test_descriptions","Qualcomm Inc. (TIA)","2015-05-13T23:47:28","Draft","INC",null,"TST 17"]
["TST-2015-0096","TS-0013 MQTT binding messages","LG Electronics","2015-05-13T12:44:48","Draft","INC",null,"TST 17"]
["TST-2015-0095","TS-0013 binding message convention","LG Electronics","2015-05-13T12:44:13","Draft","INC",null,"TST 17"]
["TST-2015-0097","TSS&TP-Test Groups","KETI","2015-05-12T09:37:34","Draft","INC",null,"TST 17"]
["TST-2015-0094","multi hop container mgmt","Mahdi Ben Alaya (LAAS-CNRS)","2015-05-11T01:48:21","Draft","CR",null,"TST 17"]
["TST-2015-0093","TS-0013_update_of_test_descriptions","Qualcomm Inc. (TIA)","2015-05-11T01:05:12","Draft","INC",null,"TST 17"]
["TST-2015-0092","non blocking asynchronous test Container","Mahdi Ben Alaya (LAAS-CNRS)","2015-05-11T00:14:08","Draft","CR",null,"TST 17"]
{"$rows_left_out":11}