{"text_format":"1","workbook":"xlsx","n_sheets":9,"sheets":["Doucment Allocation","logistics","TP","REQ","ARC","PRO","SEC","MAS","TST"],"not_rendered":{"charts":0,"images":1,"macros":1,"external_links":0,"defined_names":14,"comments":0,"pivot_tables":0},"unopened":[],"bounds":{"document_bytes":16777216,"sheet_cells":100000,"rows_first":2000,"rows_last":500,"rows_between":2000,"halvings":0,"cell_chars":16384,"cell_head_chars":4096},"cells_cut":0,"cells_raw":0,"read":"whole","date_system":"1900"}

{"sheet":"Doucment Allocation","index":0,"n_rows":63,"n_cols":13,"rows_kept":63,"cut":false,"hidden":false,"merged":[]}
["Slot","Room","WG","Doc-Number","Title","Source","Upload Time","WG disposition (Agreed, Noted, Postponed, Withdrawn)","Type (INC, CR, AG, MIN)","Work Item","Rel","Purpose","Notes"]
["Mon-3 (13:30-15:00)",{"$f":"VLOOKUP(A2,logistics!G:I,2,0)","v":"Breakout"},{"$f":"VLOOKUP(A2,logistics!G:I,3,0)","v":"MAS"},"MAS-2015-0600","Agenda MAS#18","Yongjing Zhang (Huawei, Chair)",null,"Agreed","AG"]
["Mon-3 (13:30-15:00)",{"$f":"VLOOKUP(A3,logistics!G:I,2,0)","v":"Breakout"},{"$f":"VLOOKUP(A3,logistics!G:I,3,0)","v":"MAS"},"MAS-2015-0601","MAS#18 Doc allocation","Yongjing Zhang (Huawei, Chair)",null,"Noted","AG"]
["Mon-3 (13:30-15:00)",{"$f":"VLOOKUP(A4,logistics!G:I,2,0)","v":"Breakout"},{"$f":"VLOOKUP(A4,logistics!G:I,3,0)","v":"MAS"},"MAS-2015-0593","TS-0005 Align Resource Names and Attributes","Gemalto N.V","2015-07-10T21:17:53","Noted","CR","TS-0005 (WI-0010)",1,"Decision"]
["Mon-3 (13:30-15:00)",{"$f":"VLOOKUP(A5,logistics!G:I,2,0)","v":"Breakout"},{"$f":"VLOOKUP(A5,logistics!G:I,3,0)","v":"MAS"},"MAS-2015-0593R01","TS-0005 Align Resource Names and Attributes","Gemalto N.V","2015-07-10T21:17:53","Agreed","CR","TS-0005 (WI-0010)",1,"Decision"]
["Mon-3 (13:30-15:00)",{"$f":"VLOOKUP(A6,logistics!G:I,2,0)","v":"Breakout"},{"$f":"VLOOKUP(A6,logistics!G:I,3,0)","v":"MAS"},"MAS-2015-0591","TS-0012-V0_3_0 Base Ontology update after MAS#17.3","NEC (rapporteur)","2015-07-07T10:23:36","Agreed","INC","TS-0012 (WI-0025)",2,"Decision"]
["Mon-3 (13:30-15:00)",{"$f":"VLOOKUP(A7,logistics!G:I,2,0)","v":"Breakout"},{"$f":"VLOOKUP(A7,logistics!G:I,3,0)","v":"MAS"},"MAS-2015-0597","TR-0017 Home Domain Abstract Information Model V0.5.0 Draft Baseline","KETI","2015-07-14T06:38:28","Agreed","INC","TR-0017 (WI-0017)",2,"Decision"]
["Mon-3 (13:30-15:00)",{"$f":"VLOOKUP(A8,logistics!G:I,2,0)","v":"Breakout"},{"$f":"VLOOKUP(A8,logistics!G:I,3,0)","v":"MAS"},"MAS-2015-0596","Proposed modification for Section 7 on mapping of the base ontoloy and external ontologies","Modacom","2015-07-11T12:48:04","Noted","INC","TS-0012 (WI-0025)",2,"Decision","Revision expected.\nKeep original 7.1, add 7.2 for general mapping rules between Base Ontology & external ones."]
["Mon-3 (13:30-15:00)",{"$f":"VLOOKUP(A9,logistics!G:I,2,0)","v":"Breakout"},{"$f":"VLOOKUP(A9,logistics!G:I,3,0)","v":"MAS"},"MAS-2015-0599","HGI activities transfer to oneM2M WG5","Patricia MARTIGNE, ORANGE","2015-07-20T00:36:15","Noted","INC",null,null,null,"Continue discussion on Tue"]
["Tue-1 (08:30-10:00)",{"$f":"VLOOKUP(A10,logistics!G:I,2,0)","v":"Adhoc"},{"$f":"VLOOKUP(A10,logistics!G:I,3,0)","v":"MAS"},"MAS-2015-0592","Modeling M2M app data","FUJITSU","2015-07-12T02:39:38","Draft","INC","TS-0002 (WI-0001)",2,"Discussion"]
["Tue-1 (08:30-10:00)",{"$f":"VLOOKUP(A11,logistics!G:I,2,0)","v":"Adhoc"},{"$f":"VLOOKUP(A11,logistics!G:I,3,0)","v":"MAS"},"MAS-2015-0592R01","Modeling M2M app data","FUJITSU","2015-07-20T16:17:14","Draft","INC","TS-0002 (WI-0001)",2,"Discussion","Scenarios/assumptions/intention clarified. Proposed requirements need to be revised accordingly."]
["Tue-1 (08:30-10:00)",{"$f":"VLOOKUP(A12,logistics!G:I,2,0)","v":"Adhoc"},{"$f":"VLOOKUP(A12,logistics!G:I,3,0)","v":"MAS"},"MAS-2015-0598","Semantic_Filtering_and_Discovery","NEC","2015-07-14T14:58:45","Draft","CR","TR-0007 (WI-0005)",2,"Decision","filtering based on values need FFS.\nCorresponding requirement should be covered by this Meeting."]
["Tue-4 (15:30-17:00)",{"$f":"VLOOKUP(A13,logistics!G:I,2,0)","v":"Adhoc"},{"$f":"VLOOKUP(A13,logistics!G:I,3,0)","v":"MAS"},"MAS-2015-0596R01","Proposed modification for Section 7 on mapping of the base ontoloy and external ontologies","Modacom","2015-07-21T14:34:37","Draft","INC","TS-0012 (WI-0025)",2,"Decision","Revision needed."]
["Tue-4 (15:30-17:00)",{"$f":"VLOOKUP(A14,logistics!G:I,2,0)","v":"Adhoc"},{"$f":"VLOOKUP(A14,logistics!G:I,3,0)","v":"MAS"},"TP-2015-0745","WI-0017-Home_Domain_Enablement_normative_work","LG Electronics","2015-07-13T09:38:07","Draft","CR",null,null,null,"Still concerns of opening a new TS, or too early to start the normative work before TR-17 is mature."]
["Wed-1 (08:30-10:00)",{"$f":"VLOOKUP(A15,logistics!G:I,2,0)","v":"Main"},{"$f":"VLOOKUP(A15,logistics!G:I,3,0)","v":"MAS/ARC"},"ARC-2015-1947","Multiplicity correction to objectAttribute R1","Yongjing Zhang (Huawei)","2015-07-08T03:57:43","Agreed","CR","TS-0001 (WI-0002)",1,"Decision"]
{"$rows_left_out":49}
{"sheet":"logistics","index":1,"n_rows":25,"n_cols":12,"rows_kept":25,"cut":false,"hidden":false,"merged":[]}
["WeekDay","SlotTime","Day","Slot","Time","AllSlots","MAS Slots","Rooms","WGs","WIs","Short Name","Deadline (GMT)"]
["Mon","08:30–10:30","Mon",1,"08:30–10:30",{"$f":"CONCATENATE(C2,\"-\",D2,\" (\",E2,\")\")","v":"Mon-1 (08:30–10:30)"},null,null,null,"TR-0001 (WI-0015)","Use Case Continuation","2015-07-13T13:00:00"]
["Tue","10:30-11:00","Mon",2,"11:00-12:30",{"$f":"CONCATENATE(C3,\"-\",D3,\" (\",E3,\")\")","v":"Mon-2 (11:00-12:30)"},null,null,null,"TR-0007 (WI-0005)","Semantic Study"]
["Wed","11:00-12:30","Mon",3,"13:30-15:00","Mon-3 (13:30-15:00)","Mon-3 (13:30-15:00)","Breakout","MAS","TR-0014 (WI-0018)","oneM2M AllJoyn Interworking"]
["Thu","12:30-13:30","Mon",4,"16:30-17:00",{"$f":"CONCATENATE(C5,\"-\",D5,\" (\",E5,\")\")","v":"Mon-4 (16:30-17:00)"},null,null,null,"TR-0017 (WI-0017)","Home Domain Abstract Information Model"]
["Fri","13:30-15:00","Mon",5,"17:00-20:00","Mon-5 (17:00-20:00)",null,null,null,"TS-0001 (WI-0002)","Architecture"]
[null,"15:00-16:30","Tue",1,"08:30-10:00","Tue-1 (08:30-10:00)","Tue-1 (08:30-10:00)","Adhoc","MAS","TS-0002 (WI-0001)","Requirement"]
[null,"16:30-17:00","Tue",2,"10:30-12:00","Tue-2 (10:30-12:00)",null,null,null,"TS-0004 (WI-0009)","Protocol Core"]
[null,"17:00-20:00","Tue",3,"13:30-15:00","Tue-3 (13:30-15:00)",null,null,null,"TS-0005 (WI-0010)","OMA Mapping"]
[null,null,"Tue",4,"15:30-17:00","Tue-4 (15:30-17:00)","Tue-4 (15:30-17:00)","Adhoc","MAS","TS-0006 (WI-0010)","BBF Mapping"]
[null,"08:30-10:00","Tue",5,"17:00-18:30","Tue-5 (17:00-18:30)",null,null,null,"TS-0007 (WI-0011)","SOA Architecture"]
[null,"10:00-10:30","Wed",1,"08:30-10:00","Wed-1 (08:30-10:00)","Wed-1 (08:30-10:00)","Main","MAS/ARC","TS-0012 (WI-0025)","oneM2M Base Ontology"]
[null,"10:30-12:00","Wed",2,"10:30-12:00","Wed-2 (10:30-12:00)","Wed-2 (10:30-12:00)","Adhoc","MAS","TS-0014 (WI-0024)","LWM2M_Interworking"]
[null,"12:00-13:30","Wed",3,"13:30-15:00","Wed-3 (13:30-15:00)","Wed-3 (13:30-15:00)","Main","MAS"]
[null,"13:30-15:00","Wed",4,"15:30-17:00","Wed-4 (15:30-17:00)"]
{"$rows_left_out":11}
{"sheet":"TP","index":2,"n_rows":51,"n_cols":8,"rows_kept":51,"cut":false,"hidden":false,"merged":[]}
["SHORT DOC NB","SHORTNAME","SOURCE","UPLOADED","STATUS","DOC TYPE","VERS","MEETING"]
["TP-2015-0668","TP#18_Philadelphia_Meeting_Notice","Nicole Butler, ATIS","2015-04-02T19:42:52","Draft","INV",null,"TP 18"]
["TP-2015-0668R01","TP#18_Philadelphia_Meeting_Notice","Nicole Butler, ATIS","2015-04-08T17:57:15","Draft","INV",null,"TP 18"]
["TP-2015-0730","Voting List for TP18","Karen Hughes, Secretary","2015-06-01T15:44:35","Draft","INC",null,"TP 18"]
["TP-2015-0732","LS on 3GPP Rel-13 MTC features for service capability exposure","3GPP TSG-SA WG2","2015-06-02T15:55:27","Draft","LS",null,"TP 18"]
["TP-2015-0731","Invitation to TP19_Sophia-Antipolis","ETSI","2015-06-02T15:59:50","Draft","INV",null,"TP 18"]
["TP-2015-0733","Reply LS on Extension of 3GPP Service-Information AVP","3GPP TSG-SA WG5","2015-06-03T09:30:27","Draft","LS",null,"TP 18"]
["TP-2015-0734","TP18 Social Event Invitation","ATIS and InterDigital","2015-06-11T23:21:37","Draft","INV",null,"TP 18"]
["TP-2015-0735","Application ID Input","IFAST, ILS, Telxxis (TIA TR-50)","2015-06-24T21:04:21","Draft","INC",null,"TP 18"]
["TP-2015-0737","Draft MoW 1.4.0","MoW(Enrico Scarrone)","2015-07-07T10:05:14","Draft","STR",null,"TP 18"]
["TP-2015-0738","MoW_M&P_Report_at_TP18","MoW convenor  (Enrico Scarrone)","2015-07-07T10:23:00","Draft","STR",null,"TP 18"]
["TP-2015-0739","WI-0018_CR_for_Rapporture_change","LG Electronics","2015-07-08T05:26:00","Approved","CR",null,"TP 18"]
["TP-2015-0740","LSout 3GPP SA5 Code Point","Ericsson","2015-07-09T16:39:15","Draft","LS",null,"TP 18"]
["TP-2015-0742","WI-00xx-Application developer guide","ETSI","2015-07-10T16:36:51","Draft","INC",null,"TP 18"]
["TP-2015-0743","Connecting ISO TC204 (ITS)","Tseng Infoserv, LLC","2015-07-12T12:35:13","Draft","INC",null,"TP 18"]
{"$rows_left_out":37}
{"sheet":"REQ","index":3,"n_rows":36,"n_cols":8,"rows_kept":36,"cut":false,"hidden":false,"merged":[]}
["SHORT DOC NB","SHORTNAME","SOURCE","UPLOADED","STATUS","DOC TYPE","VERS","MEETING"]
["REQ-2015-0589R01","Usecase on vehicle data wipe service","TOYOTA ITC","2015-07-07T11:35:50","Draft","INC",null,"REQ 18"]
["REQ-2015-0590","SEC_related_CR_to_TS-0002_on_Trust_transfer","NEC","2015-07-10T17:17:49","Draft","INC",null,"REQ 18"]
["REQ-2015-0591","CR_to_TS-0002_on_dynamic_Verification_of_GW_Processing_Integrity","NEC","2015-07-10T17:37:28","Draft","INC",null,"REQ 18"]
["REQ-2015-0592","Add App-ID Abbreviations and Definitions","Darold Hemphill - iconectiv","2015-07-10T18:54:44","Draft","CR",null,"REQ 18"]
["REQ-2015-0596","Event Trigger Use Case Revise","FUJITSU","2015-07-12T06:20:45","Draft","CR",null,"REQ 18"]
["REQ-2015-0595","External Event Trigger Requirements","FUJITSU","2015-07-12T06:21:38","Draft","CR",null,"REQ 18"]
["REQ-2015-0597","Use Case Anycast Somecast","InterDigital","2015-07-12T19:24:33","Draft","CR",null,"REQ 18"]
["REQ-2015-0598","TS-0002 anycast somecast requirements","InterDigital","2015-07-12T19:24:50","Draft","CR",null,"REQ 18"]
["REQ-2015-0599","Sensor Data Quality","Hitachi","2015-07-13T03:30:07","Draft","INC",null,"REQ 18"]
["REQ-2015-0600","Real Time Data Collection","Hitachi","2015-07-13T03:43:48","Draft","INC",null,"REQ 18"]
["REQ-2015-0601","Requirement of supporting Real Time Data Collection","Hitachi","2015-07-13T04:10:58","Draft","INC",null,"REQ 18"]
["REQ-2015-0602","Requirement of supporting Quality of Sensor Data","Hitachi","2015-07-13T04:20:52","Draft","INC",null,"REQ 18"]
["REQ-2015-0603","Data_encryption_in_industrial_domain","Hitachi","2015-07-13T04:59:05","Draft","INC",null,"REQ 18"]
["REQ-2015-0604","Requirement_of_supporting_data_encryption_in_industrial_domain","Hitachi","2015-07-13T05:01:41","Draft","CR",null,"REQ 18"]
{"$rows_left_out":22}
{"sheet":"ARC","index":4,"n_rows":158,"n_cols":8,"rows_kept":158,"cut":false,"hidden":false,"merged":[]}
["SHORT DOC NB","SHORTNAME","SOURCE","UPLOADED","STATUS","DOC TYPE","VERS","MEETING"]
["ARC-2015-1934","CR CSEBase resource type (R1)","LG Electronics","2015-06-11T08:42:27","Agreed","CR",null,"ARC 18"]
["ARC-2015-1935","CR CSEBase resource type (R2)","LG Electronics","2015-06-11T08:43:53","Agreed","CR",null,"ARC 18"]
["ARC-2015-1940R01","CR for hostedCSEID attribute name correction","C-DOT","2015-06-25T05:51:19","Draft","CR",null,"ARC 18"]
["ARC-2015-1941","CR for serviceSubscribedNode - ruleLinks attribute","C-DOT (Anupama,Poornima)","2015-06-25T06:30:30","Draft","CR",null,"ARC 18"]
["ARC-2015-1942","CR for CRUD on m2mServiceSubscriptionProfile and serviceSubscribedNode","C-DOT (Anupama,Poornima)","2015-07-02T05:43:50","Draft","CR",null,"ARC 18"]
["ARC-2015-1944","Minutes ARC17-3","Karen Hughes, Secretariat","2015-07-02T15:08:23","Agreed","MIN",null,"ARC 18"]
["ARC-2015-1945","Simple word errors correction","LG Electronics","2015-07-03T09:36:47","Agreed","CR",null,"ARC 18"]
["ARC-2015-1947","Multiplicity correction to objectAttribute R1","Yongjing Zhang (Huawei)","2015-07-08T03:57:43","Draft","CR",null,"ARC 18"]
["ARC-2015-1948","Multiplicity correction to objectAttribute R2","Yongjing Zhang (Huawei)","2015-07-08T03:57:56","Draft","CR",null,"ARC 18"]
["ARC-2015-1946","TR-0014-oneM2M_and_AllJoyn_interworking-V0_4_0_Draft","LG Electronics","2015-07-08T05:24:56","Noted","INC",null,"ARC 18"]
["ARC-2015-1949","Target-Notification-Disposition-Policy-Editorial-Enhancements","Ericsson","2015-07-10T12:14:12","Draft","CR",null,"ARC 18"]
["ARC-2015-1950","Procedure-notification-target-removal-Editorial-Enhancements","Ericsson","2015-07-10T12:16:58","Draft","CR",null,"ARC 18"]
["ARC-2015-1951","Mirror1915R01-Resource-Request-Attributes-Duplication","Ericsson","2015-07-10T12:18:26","Draft","CR",null,"ARC 18"]
["ARC-2015-1952","Name-Change-Notification-Target-Deletion-Policies","Ericsson","2015-07-10T12:19:37","Agreed","CR",null,"ARC 18"]
{"$rows_left_out":144}
{"sheet":"PRO","index":5,"n_rows":52,"n_cols":8,"rows_kept":52,"cut":false,"hidden":false,"merged":[]}
["SHORT DOC NB","SHORTNAME","SOURCE","UPLOADED","STATUS","DOC TYPE","VERS","MEETING"]
["PRO-2015-0783R02","Clarification_on_XSD_usage","Qualcomm Inc. (TIA), FUJITSU","2015-06-05T19:57:22","Draft","CR",null,"PRO 18"]
["PRO-2015-0815","CR schedule resource type","LG Electronics","2015-06-11T08:29:21","Draft","CR",null,"PRO 18"]
["PRO-2015-0768R03","CR_parameter_default_values","LG Electronics","2015-06-11T08:30:01","Draft","CR",null,"PRO 18"]
["PRO-2015-0819R01","Step value syntax for scheduleElement","QUALCOMM","2015-06-30T15:12:16","Draft","CR",null,"PRO 18"]
["PRO-2015-0808R01","CR_TS-0009_response_code_mapping_enhancement","LG Electronics","2015-07-03T06:13:42","Draft","CR",null,"PRO 18"]
["PRO-2015-0822","CR_poa_for_mqtt","LG Electronics","2015-07-03T09:14:29","Draft","CR",null,"PRO 18"]
["PRO-2015-0823","CR_accessControlRule_data_type","LG Electronics","2015-07-03T09:15:30","Draft","CR",null,"PRO 18"]
["PRO-2015-0824","CR_missing_shortnames","FUJITSU","2015-07-05T03:28:30","Draft","CR",null,"PRO 18"]
["PRO-2015-0825","CR_missing_shortnames(Mirrored)","FUJITSU","2015-07-05T03:31:22","Draft","CR",null,"PRO 18"]
["PRO-2015-0824R01","CR_missing_shortnames","FUJITSU","2015-07-05T10:54:35","Draft","CR",null,"PRO 18"]
["PRO-2015-0825R01","CR_missing_shortnames(Mirrored)","FUJITSU","2015-07-05T10:57:42","Draft","CR",null,"PRO 18"]
["PRO-2015-0824R02","CR_missing_shortnames","FUJITSU","2015-07-05T11:37:59","Draft","CR",null,"PRO 18"]
["PRO-2015-0825R02","CR_missing_shortnames(Mirrored)","FUJITSU","2015-07-05T11:41:07","Draft","CR",null,"PRO 18"]
["PRO-2015-0826","XSD long to short conversion","FUJITSU","2015-07-05T11:58:16","Draft","INC",null,"PRO 18"]
{"$rows_left_out":38}
{"sheet":"SEC","index":6,"n_rows":26,"n_cols":8,"rows_kept":26,"cut":false,"hidden":false,"merged":[]}
["SHORT DOC NB","SHORTNAME","SOURCE","UPLOADED","STATUS","DOC TYPE","VERS","MEETING"]
["SEC-2015-0551","CR for naming correction in figures","C-DOT (Anupama,Poornima)","2015-07-08T06:13:26","Draft","CR",null,"SEC 18"]
["SEC-2015-0552","CR for section reference corrections","C-DOT (Anupama,Poornima)","2015-07-08T06:37:11","Draft","CR",null,"SEC 18"]
["SEC-2015-0553","SE reference point","Giesecke & Devrient","2015-07-08T07:54:36","Draft","INC",null,"SEC 18"]
["SEC-2015-0554","SE abstraction architecture","Giesecke & Devrient","2015-07-08T07:55:21","Draft","INC",null,"SEC 18"]
["SEC-2015-0555","Types of SEs","Giesecke & Devrient","2015-07-08T08:03:59","Draft","INC",null,"SEC 18"]
["SEC-2015-0556","CR for word correction provisioned to pre-provisioned","C-DOT (Suman,Poornima)","2015-07-08T09:20:56","Draft","CR",null,"SEC 18"]
["SEC-2015-0557","TACML-PPM","BT Group","2015-07-12T12:27:29","Draft","INC",null,"SEC 18"]
["SEC-2015-0558","use-case-requirements-end-to-end-authentication-using-delegation","InterDigital","2015-07-13T02:18:05","Draft","CR",null,"SEC 18"]
["SEC-2015-0559","discussions-on-end-to-end-data-security","InterDigital","2015-07-13T02:23:14","Draft","CR",null,"SEC 18"]
["SEC-2015-0560","definitions-for-end-to-end-data-security","InterDigital","2015-07-13T02:26:29","Draft","CR",null,"SEC 18"]
["SEC-2015-0561","use-case-requirements-for-end-to-end-data-integrity","InterDigital","2015-07-13T02:29:20","Draft","CR",null,"SEC 18"]
["SEC-2015-0562","use-case-requirements-for-end-to-end-data-confidentiality","InterDigital","2015-07-13T02:32:26","Draft","CR",null,"SEC 18"]
["SEC-2015-0563","Group Authentication Solution","China Mobile","2015-07-13T06:47:54","Draft","INC",null,"SEC 18"]
["SEC-2015-0564","TR-0019 Role Token Use Case for Dynamic Authorization","Datang, CATR","2015-07-13T08:02:24","Draft","INC",null,"SEC 18"]
{"$rows_left_out":12}
{"sheet":"MAS","index":7,"n_rows":32,"n_cols":8,"rows_kept":32,"cut":false,"hidden":false,"merged":[]}
["SHORT DOC NB","SHORTNAME","SOURCE","UPLOADED","STATUS","DOC TYPE","VERS","MEETING"]
["MAS-2015-0591","TS-0012-V0_3_0 Base Ontology update after MAS#17.3","NEC (rapporteur)","2015-07-07T10:23:36","Agreed","INC",null,"MAS 18"]
["MAS-2015-0594","Discussions on semantic description  rules","China Unicom","2015-07-10T15:44:34","Draft","INC",null,"MAS 18"]
["MAS-2015-0593","TS-0005 Align Resource Names and Attributes","Gemalto N.V","2015-07-10T21:17:53","Draft","CR",null,"MAS 18"]
["MAS-2015-0596","Proposed modification for Section 7 on mapping of the base ontoloy and external ontologies","Modacom","2015-07-11T12:48:04","Draft","INC",null,"MAS 18"]
["MAS-2015-0592","Modeling M2M app data","FUJITSU","2015-07-12T02:39:38","Draft","INC",null,"MAS 18"]
["REQ-2015-0593","Requirement for collecting data from M2M device","FUJITSU","2015-07-12T02:53:39","Draft","CR",null,"MAS 18"]
["MAS-2015-0595","TS-0012 Update on Base Ontology and Mapping to oneM2M Resources","NEC","2015-07-13T15:25:39","Draft","INC",null,"MAS 18"]
["MAS-2015-0597","TR-0017 Home Domain Abstract Information Model V0.5.0 Draft Baseline","KETI","2015-07-14T06:38:28","Agreed","INC",null,"MAS 18"]
["MAS-2015-0598","Semantic_Filtering_and_Discovery","NEC","2015-07-14T14:58:45","Draft","CR",null,"MAS 18"]
["MAS-2015-0600","Agenda MAS#18","Yongjing Zhang (Huawei, Chair)","2015-07-16T06:58:24","Draft","AG",null,"MAS 18"]
["MAS-2015-0601","MAS#18 Doc allocation","Yongjing Zhang (Huawei, Chair)","2015-07-16T06:58:36","Draft","AG",null,"MAS 18"]
["MAS-2015-0599","HGI activities transfer to oneM2M WG5","Patricia MARTIGNE, ORANGE","2015-07-20T00:36:15","Draft","INC",null,"MAS 18"]
["MAS-2015-0601R01","MAS#18 Doc allocation","Yongjing Zhang (Huawei, Chair)","2015-07-20T03:00:12","Draft","AG",null,"MAS 18"]
["MAS-2015-0600R01","Agenda MAS#18","Yongjing Zhang (Huawei, Chair)","2015-07-20T03:12:38","Draft","AG",null,"MAS 18"]
{"$rows_left_out":18}
{"sheet":"TST","index":8,"n_rows":36,"n_cols":8,"rows_kept":36,"cut":false,"hidden":false,"merged":[]}
["SHORT DOC NB","SHORTNAME","SOURCE","UPLOADED","STATUS","DOC TYPE","VERS","MEETING"]
["TST-2015-0123","ICS baseline v0.0.2","KETI","2015-07-08T13:47:03","Draft","INC",null,"TST 18"]
["TST-2015-0124","Issues_pertaining_to_IOP_test","Huawei Technologies Co., Ltd.","2015-07-12T06:49:01","Draft","INC",null,"TST 18"]
["TST-2015-0125","Collection of pre-conditions","Huawei Technologies Co., Ltd.","2015-07-12T06:50:37","Draft","INC",null,"TST 18"]
["TST-2015-0126","Rearangement_of_clause_7_of_TS0013","Huawei Technologies Co., Ltd.","2015-07-12T06:52:22","Draft","INC",null,"TST 18"]
["TST-2015-0127","Test_Description_Restructuring","Huawei Technologies Co., Ltd.","2015-07-12T06:54:34","Draft","INC",null,"TST 18"]
["TST-2015-0128","Test_Description_for_CRUDN","Huawei Technologies Co., Ltd.","2015-07-12T06:55:42","Draft","INC",null,"TST 18"]
["TST-2015-0129","Test_Description_for_NonBlockingRequest","Huawei Technologies Co., Ltd.","2015-07-12T06:56:33","Draft","INC",null,"TST 18"]
["TST-2015-0130","Test_Description_for_node","Huawei Technologies Co., Ltd.","2015-07-12T06:57:20","Draft","INC",null,"TST 18"]
["TST-2015-0131","TS-0013-No-Hop-Tests-Update","InterDigital","2015-07-12T16:51:02","Draft","INC",null,"TST 18"]
["TST-2015-0132","TS-0013-Group-FanoutPoint-Tests","InterDigital","2015-07-12T16:54:38","Draft","INC",null,"TST 18"]
["TST-2015-0133","TS-0013-Notification-Tests","InterDigital","2015-07-12T16:57:11","Draft","INC",null,"TST 18"]
["TST-2015-0134","TS-00015-Interop testing methodology","ETSI","2015-07-12T21:49:25","Draft","INC",null,"TST 18"]
["TST-2015-0135","TS-0013-Test Description proforma","ETSI","2015-07-12T22:20:01","Draft","INC",null,"TST 18"]
["TST-2015-0136","Test_Description_for_fanOutPoint","Huawei Technologies Co., Ltd.","2015-07-13T07:16:00","Draft","INC",null,"TST 18"]
{"$rows_left_out":21}