{"text_format":"1","workbook":"xlsx","n_sheets":10,"sheets":["Doucment Allocation","logistics","AllDocs","TP","REQ","ARC","PRO","SEC","MAS","TST"],"not_rendered":{"charts":0,"images":1,"macros":1,"external_links":0,"defined_names":14,"comments":0,"pivot_tables":0},"unopened":[],"bounds":{"document_bytes":16777216,"sheet_cells":100000,"rows_first":2000,"rows_last":500,"rows_between":2000,"halvings":0,"cell_chars":16384,"cell_head_chars":4096},"cells_cut":0,"cells_raw":0,"read":"whole","date_system":"1900"}

{"sheet":"Doucment Allocation","index":0,"n_rows":64,"n_cols":13,"rows_kept":64,"cut":false,"hidden":false,"merged":[]}
["Slot","Room","WG","Doc-Number","Title","Source","Upload Time","WG disposition (Agreed, Noted, Postponed, Withdrawn)","Type (INC, CR, AG, MIN)","Work Item","Rel","Purpose","Notes"]
["Mon-3 (13:30-15:00)",{"$f":"VLOOKUP(A2,logistics!G:I,2,0)","v":"Breakout"},{"$f":"VLOOKUP(A2,logistics!G:I,3,0)","v":"MAS"},"MAS-2015-0600",{"$f":"VLOOKUP(D2,AllDocs!A:D,2,0)","v":"Agenda MAS#18"},{"$f":"VLOOKUP(D2,AllDocs!A:D,3,0)","v":"Yongjing Zhang (Huawei, Chair)"},{"$f":"VLOOKUP(D2,AllDocs!A:D,4,0)","v":"2015-07-16T06:58:24"},"Agreed",{"$f":"VLOOKUP(D2,AllDocs!A:F,6,0)","v":"AG"}]
["Mon-3 (13:30-15:00)",{"$f":"VLOOKUP(A3,logistics!G:I,2,0)","v":"Breakout"},{"$f":"VLOOKUP(A3,logistics!G:I,3,0)","v":"MAS"},"MAS-2015-0601",{"$f":"VLOOKUP(D3,AllDocs!A:D,2,0)","v":"MAS#18 Doc allocation"},{"$f":"VLOOKUP(D3,AllDocs!A:D,3,0)","v":"Yongjing Zhang (Huawei, Chair)"},{"$f":"VLOOKUP(D3,AllDocs!A:D,4,0)","v":"2015-07-16T06:58:36"},"Noted",{"$f":"VLOOKUP(D3,AllDocs!A:F,6,0)","v":"AG"}]
["Mon-3 (13:30-15:00)",{"$f":"VLOOKUP(A4,logistics!G:I,2,0)","v":"Breakout"},{"$f":"VLOOKUP(A4,logistics!G:I,3,0)","v":"MAS"},"MAS-2015-0593",{"$f":"VLOOKUP(D4,AllDocs!A:D,2,0)","v":"TS-0005 Align Resource Names and Attributes"},{"$f":"VLOOKUP(D4,AllDocs!A:D,3,0)","v":"Gemalto N.V"},{"$f":"VLOOKUP(D4,AllDocs!A:D,4,0)","v":"2015-07-10T21:17:53"},"Noted",{"$f":"VLOOKUP(D4,AllDocs!A:F,6,0)","v":"CR"},"TS-0005 (WI-0010)",1,"Decision"]
["Mon-3 (13:30-15:00)",{"$f":"VLOOKUP(A5,logistics!G:I,2,0)","v":"Breakout"},{"$f":"VLOOKUP(A5,logistics!G:I,3,0)","v":"MAS"},"MAS-2015-0593R01",{"$f":"VLOOKUP(D5,AllDocs!A:D,2,0)","v":"TS-0005 Align Resource Names and Attributes"},{"$f":"VLOOKUP(D5,AllDocs!A:D,3,0)","v":"Gemalto N.V"},{"$f":"VLOOKUP(D5,AllDocs!A:D,4,0)","v":"2015-07-20T19:13:26"},"Agreed",{"$f":"VLOOKUP(D5,AllDocs!A:F,6,0)","v":"CR"},"TS-0005 (WI-0010)",1,"Decision"]
["Mon-3 (13:30-15:00)",{"$f":"VLOOKUP(A6,logistics!G:I,2,0)","v":"Breakout"},{"$f":"VLOOKUP(A6,logistics!G:I,3,0)","v":"MAS"},"MAS-2015-0591",{"$f":"VLOOKUP(D6,AllDocs!A:D,2,0)","v":"TS-0012-V0_3_0 Base Ontology update after MAS#17.3"},{"$f":"VLOOKUP(D6,AllDocs!A:D,3,0)","v":"NEC (rapporteur)"},{"$f":"VLOOKUP(D6,AllDocs!A:D,4,0)","v":"2015-07-07T10:23:36"},"Agreed",{"$f":"VLOOKUP(D6,AllDocs!A:F,6,0)","v":"INC"},"TS-0012 (WI-0025)",2,"Decision"]
["Mon-3 (13:30-15:00)",{"$f":"VLOOKUP(A7,logistics!G:I,2,0)","v":"Breakout"},{"$f":"VLOOKUP(A7,logistics!G:I,3,0)","v":"MAS"},"MAS-2015-0597",{"$f":"VLOOKUP(D7,AllDocs!A:D,2,0)","v":"TR-0017 Home Domain Abstract Information Model V0.5.0 Draft Baseline"},{"$f":"VLOOKUP(D7,AllDocs!A:D,3,0)","v":"KETI"},{"$f":"VLOOKUP(D7,AllDocs!A:D,4,0)","v":"2015-07-14T06:38:28"},"Agreed",{"$f":"VLOOKUP(D7,AllDocs!A:F,6,0)","v":"INC"},"TR-0017 (WI-0017)",2,"Decision"]
["Mon-3 (13:30-15:00)",{"$f":"VLOOKUP(A8,logistics!G:I,2,0)","v":"Breakout"},{"$f":"VLOOKUP(A8,logistics!G:I,3,0)","v":"MAS"},"MAS-2015-0596",{"$f":"VLOOKUP(D8,AllDocs!A:D,2,0)","v":"Proposed modification for Section 7 on mapping of the base ontoloy and external ontologies"},{"$f":"VLOOKUP(D8,AllDocs!A:D,3,0)","v":"Modacom"},{"$f":"VLOOKUP(D8,AllDocs!A:D,4,0)","v":"2015-07-11T12:48:04"},"Noted",{"$f":"VLOOKUP(D8,AllDocs!A:F,6,0)","v":"INC"},"TS-0012 (WI-0025)",2,"Decision","Revision expected.\nKeep original 7.1, add 7.2 for general mapping rules between Base Ontology & external ones."]
["Mon-3 (13:30-15:00)",{"$f":"VLOOKUP(A9,logistics!G:I,2,0)","v":"Breakout"},{"$f":"VLOOKUP(A9,logistics!G:I,3,0)","v":"MAS"},"MAS-2015-0599",{"$f":"VLOOKUP(D9,AllDocs!A:D,2,0)","v":"HGI activities transfer to oneM2M WG5"},{"$f":"VLOOKUP(D9,AllDocs!A:D,3,0)","v":"Patricia MARTIGNE, ORANGE"},{"$f":"VLOOKUP(D9,AllDocs!A:D,4,0)","v":"2015-07-20T00:36:15"},"Noted",{"$f":"VLOOKUP(D9,AllDocs!A:F,6,0)","v":"INC"},null,null,null,"Continue discussion on Tue"]
["Tue-1 (08:30-10:00)",{"$f":"VLOOKUP(A10,logistics!G:I,2,0)","v":"Adhoc"},{"$f":"VLOOKUP(A10,logistics!G:I,3,0)","v":"MAS"},"MAS-2015-0592",{"$f":"VLOOKUP(D10,AllDocs!A:D,2,0)","v":"Modeling M2M app data"},{"$f":"VLOOKUP(D10,AllDocs!A:D,3,0)","v":"FUJITSU"},{"$f":"VLOOKUP(D10,AllDocs!A:D,4,0)","v":"2015-07-12T02:39:38"},"Draft",{"$f":"VLOOKUP(D10,AllDocs!A:F,6,0)","v":"INC"},"TS-0002 (WI-0001)",2,"Discussion"]
["Tue-1 (08:30-10:00)",{"$f":"VLOOKUP(A11,logistics!G:I,2,0)","v":"Adhoc"},{"$f":"VLOOKUP(A11,logistics!G:I,3,0)","v":"MAS"},"MAS-2015-0592R01",{"$f":"VLOOKUP(D11,AllDocs!A:D,2,0)","v":"Modeling M2M app data"},{"$f":"VLOOKUP(D11,AllDocs!A:D,3,0)","v":"FUJITSU"},{"$f":"VLOOKUP(D11,AllDocs!A:D,4,0)","v":"2015-07-20T16:17:14"},"Draft",{"$f":"VLOOKUP(D11,AllDocs!A:F,6,0)","v":"INC"},"TS-0002 (WI-0001)",2,"Discussion","Scenarios/assumptions/intention clarified. Proposed requirements need to be revised accordingly."]
["Tue-1 (08:30-10:00)",{"$f":"VLOOKUP(A12,logistics!G:I,2,0)","v":"Adhoc"},{"$f":"VLOOKUP(A12,logistics!G:I,3,0)","v":"MAS"},"MAS-2015-0598",{"$f":"VLOOKUP(D12,AllDocs!A:D,2,0)","v":"Semantic_Filtering_and_Discovery"},{"$f":"VLOOKUP(D12,AllDocs!A:D,3,0)","v":"NEC"},{"$f":"VLOOKUP(D12,AllDocs!A:D,4,0)","v":"2015-07-14T14:58:45"},"Draft",{"$f":"VLOOKUP(D12,AllDocs!A:F,6,0)","v":"CR"},"TR-0007 (WI-0005)",2,"Decision","filtering based on values need FFS.\nCorresponding requirement should be covered by this Meeting."]
["Tue-4 (15:30-17:00)",{"$f":"VLOOKUP(A13,logistics!G:I,2,0)","v":"Adhoc"},{"$f":"VLOOKUP(A13,logistics!G:I,3,0)","v":"MAS"},"MAS-2015-0596R01",{"$f":"VLOOKUP(D13,AllDocs!A:D,2,0)","v":"Proposed modification for Section 7 on mapping of the base ontoloy and external ontologies"},{"$f":"VLOOKUP(D13,AllDocs!A:D,3,0)","v":"Modacom"},{"$f":"VLOOKUP(D13,AllDocs!A:D,4,0)","v":"2015-07-21T14:34:37"},"Draft",{"$f":"VLOOKUP(D13,AllDocs!A:F,6,0)","v":"INC"},"TS-0012 (WI-0025)",2,"Decision","Revision needed."]
["Tue-4 (15:30-17:00)",{"$f":"VLOOKUP(A14,logistics!G:I,2,0)","v":"Adhoc"},{"$f":"VLOOKUP(A14,logistics!G:I,3,0)","v":"MAS"},"TP-2015-0745",{"$f":"VLOOKUP(D14,AllDocs!A:D,2,0)","v":"WI-0017-Home_Domain_Enablement_normative_work"},{"$f":"VLOOKUP(D14,AllDocs!A:D,3,0)","v":"LG Electronics"},{"$f":"VLOOKUP(D14,AllDocs!A:D,4,0)","v":"2015-07-13T09:38:07"},"Draft",{"$f":"VLOOKUP(D14,AllDocs!A:F,6,0)","v":"CR"},null,null,null,"Still concerns of opening a new TS, or too early to start the normative work before TR-17 is mature."]
["Wed-1 (08:30-10:00)",{"$f":"VLOOKUP(A15,logistics!G:I,2,0)","v":"Main"},{"$f":"VLOOKUP(A15,logistics!G:I,3,0)","v":"MAS/ARC"},"ARC-2015-1947",{"$f":"VLOOKUP(D15,AllDocs!A:D,2,0)","v":"Multiplicity correction to objectAttribute R1"},{"$f":"VLOOKUP(D15,AllDocs!A:D,3,0)","v":"Yongjing Zhang (Huawei)"},{"$f":"VLOOKUP(D15,AllDocs!A:D,4,0)","v":"2015-07-08T03:57:43"},"Agreed",{"$f":"VLOOKUP(D15,AllDocs!A:F,6,0)","v":"CR"},"TS-0001 (WI-0002)",1,"Decision"]
{"$rows_left_out":50}
{"sheet":"logistics","index":1,"n_rows":25,"n_cols":12,"rows_kept":25,"cut":false,"hidden":false,"merged":[]}
["WeekDay","SlotTime","Day","Slot","Time","AllSlots","MAS Slots","Rooms","WGs","WIs","Short Name","Deadline (GMT)"]
["Mon","08:30–10:30","Mon",1,"08:30–10:30",{"$f":"CONCATENATE(C2,\"-\",D2,\" (\",E2,\")\")","v":"Mon-1 (08:30–10:30)"},null,null,null,"TR-0001 (WI-0015)","Use Case Continuation","2015-07-13T13:00:00"]
["Tue","10:30-11:00","Mon",2,"11:00-12:30",{"$f":"CONCATENATE(C3,\"-\",D3,\" (\",E3,\")\")","v":"Mon-2 (11:00-12:30)"},null,null,null,"TR-0007 (WI-0005)","Semantic Study"]
["Wed","11:00-12:30","Mon",3,"13:30-15:00","Mon-3 (13:30-15:00)","Mon-3 (13:30-15:00)","Breakout","MAS","TR-0014 (WI-0018)","oneM2M AllJoyn Interworking"]
["Thu","12:30-13:30","Mon",4,"16:30-17:00",{"$f":"CONCATENATE(C5,\"-\",D5,\" (\",E5,\")\")","v":"Mon-4 (16:30-17:00)"},null,null,null,"TR-0017 (WI-0017)","Home Domain Abstract Information Model"]
["Fri","13:30-15:00","Mon",5,"17:00-20:00","Mon-5 (17:00-20:00)",null,null,null,"TS-0001 (WI-0002)","Architecture"]
[null,"15:00-16:30","Tue",1,"08:30-10:00","Tue-1 (08:30-10:00)","Tue-1 (08:30-10:00)","Adhoc","MAS","TS-0002 (WI-0001)","Requirement"]
[null,"16:30-17:00","Tue",2,"10:30-12:00","Tue-2 (10:30-12:00)",null,null,null,"TS-0004 (WI-0009)","Protocol Core"]
[null,"17:00-20:00","Tue",3,"13:30-15:00","Tue-3 (13:30-15:00)",null,null,null,"TS-0005 (WI-0010)","OMA Mapping"]
[null,null,"Tue",4,"15:30-17:00","Tue-4 (15:30-17:00)","Tue-4 (15:30-17:00)","Adhoc","MAS","TS-0006 (WI-0010)","BBF Mapping"]
[null,"08:30-10:00","Tue",5,"17:00-18:30","Tue-5 (17:00-18:30)",null,null,null,"TS-0007 (WI-0011)","SOA Architecture"]
[null,"10:00-10:30","Wed",1,"08:30-10:00","Wed-1 (08:30-10:00)","Wed-1 (08:30-10:00)","Main","MAS/ARC","TS-0012 (WI-0025)","oneM2M Base Ontology"]
[null,"10:30-12:00","Wed",2,"10:30-12:00","Wed-2 (10:30-12:00)","Wed-2 (10:30-12:00)","Adhoc","MAS","TS-0014 (WI-0024)","LWM2M_Interworking"]
[null,"12:00-13:30","Wed",3,"13:30-15:00","Wed-3 (13:30-15:00)","Wed-3 (13:30-15:00)","Main","MAS"]
[null,"13:30-15:00","Wed",4,"15:30-17:00","Wed-4 (15:30-17:00)"]
{"$rows_left_out":11}
{"sheet":"AllDocs","index":2,"n_rows":678,"n_cols":8,"rows_kept":678,"cut":false,"hidden":false,"merged":[]}
["SHORT DOC NB","SHORTNAME","SOURCE","UPLOADED","STATUS","DOC TYPE","VERS","MEETING"]
["ARC-2015-1902R01","CR_structured_resource_ID_clarification","LG Electronics","2015-07-13T09:07:33","Draft","CR",null,"ARC 18"]
["ARC-2015-1903R01","CR_structured_resource_ID_clarification(R2)","LG Electronics","2015-07-13T09:09:50","Draft","CR",null,"ARC 18"]
["ARC-2015-1934","CR CSEBase resource type (R1)","LG Electronics","2015-06-11T08:42:27","Agreed","CR",null,"ARC 18"]
["ARC-2015-1935","CR CSEBase resource type (R2)","LG Electronics","2015-06-11T08:43:53","Agreed","CR",null,"ARC 18"]
["ARC-2015-1940R01","CR for hostedCSEID attribute name correction","C-DOT","2015-06-25T05:51:19","Draft","CR",null,"ARC 18"]
["ARC-2015-1941","CR for serviceSubscribedNode - ruleLinks attribute","C-DOT (Anupama,Poornima)","2015-06-25T06:30:30","Draft","CR",null,"ARC 18"]
["ARC-2015-1942","CR for CRUD on m2mServiceSubscriptionProfile and serviceSubscribedNode","C-DOT (Anupama,Poornima)","2015-07-02T05:43:50","Draft","CR",null,"ARC 18"]
["ARC-2015-1944","Minutes ARC17-3","Karen Hughes, Secretariat","2015-07-02T15:08:23","Agreed","MIN",null,"ARC 18"]
["ARC-2015-1945","Simple word errors correction","LG Electronics","2015-07-03T09:36:47","Agreed","CR",null,"ARC 18"]
["ARC-2015-1946","TR-0014-oneM2M_and_AllJoyn_interworking-V0_4_0_Draft","LG Electronics","2015-07-08T05:24:56","Noted","INC",null,"ARC 18"]
["ARC-2015-1946R01","TR-0014-oneM2M_and_AllJoyn_interworking-V0_4_0_Draft","LG Electronics","2015-07-20T21:42:10","Draft","INC",null,"ARC 18"]
["ARC-2015-1947","Multiplicity correction to objectAttribute R1","Yongjing Zhang (Huawei)","2015-07-08T03:57:43","Draft","CR",null,"ARC 18"]
["ARC-2015-1948","Multiplicity correction to objectAttribute R2","Yongjing Zhang (Huawei)","2015-07-08T03:57:56","Draft","CR",null,"ARC 18"]
["ARC-2015-1949","Target-Notification-Disposition-Policy-Editorial-Enhancements","Ericsson","2015-07-10T12:14:12","Draft","CR",null,"ARC 18"]
{"$rows_left_out":664}
{"sheet":"TP","index":3,"n_rows":125,"n_cols":8,"rows_kept":125,"cut":false,"hidden":false,"merged":[]}
["SHORT DOC NB","SHORTNAME","SOURCE","UPLOADED","STATUS","DOC TYPE","VERS","MEETING"]
["MAS-2015-0599R02","HGI activities transfer to oneM2M WG5","Patricia MARTIGNE, ORANGE","2015-07-22T17:53:47","Draft","INC",null,"TP 18"]
["MAS-2015-0602","Minutes MAS TP18","secretary",null,"Draft","MIN",null,"TP 18"]
["TP-2015-0668","TP#18_Philadelphia_Meeting_Notice","Nicole Butler, ATIS","2015-04-02T19:42:52","Draft","INV",null,"TP 18"]
["TP-2015-0668R01","TP#18_Philadelphia_Meeting_Notice","Nicole Butler, ATIS","2015-04-08T17:57:15","Draft","INV",null,"TP 18"]
["TP-2015-0730","Voting List for TP18","Karen Hughes, Secretary","2015-06-01T15:44:35","Draft","INC",null,"TP 18"]
["TP-2015-0731","Invitation to TP19_Sophia-Antipolis","ETSI","2015-06-02T15:59:50","Draft","INV",null,"TP 18"]
["TP-2015-0732","LS on 3GPP Rel-13 MTC features for service capability exposure","3GPP TSG-SA WG2","2015-06-02T15:55:27","Draft","LS",null,"TP 18"]
["TP-2015-0733","Reply LS on Extension of 3GPP Service-Information AVP","3GPP TSG-SA WG5","2015-06-03T09:30:27","Draft","LS",null,"TP 18"]
["TP-2015-0734","TP18 Social Event Invitation","ATIS and InterDigital","2015-06-11T23:21:37","Draft","INV",null,"TP 18"]
["TP-2015-0735","Application ID Input","IFAST, ILS, Telxxis (TIA TR-50)","2015-06-24T21:04:21","Draft","INC",null,"TP 18"]
["TP-2015-0736","oneM2M based implementations","JaeSeung Song (KETI)","2015-07-14T20:21:05","Noted","INC",null,"TP 18"]
["TP-2015-0736R01","oneM2M based implementations","JaeSeung Song (KETI)","2015-07-15T11:18:15","Noted","INC",null,"TP 18"]
["TP-2015-0737","Draft MoW 1.4.0","MoW(Enrico Scarrone)","2015-07-07T10:05:14","Draft","STR",null,"TP 18"]
["TP-2015-0738","MoW_M&P_Report_at_TP18","MoW convenor  (Enrico Scarrone)","2015-07-07T10:23:00","Draft","STR",null,"TP 18"]
{"$rows_left_out":111}
{"sheet":"REQ","index":4,"n_rows":105,"n_cols":8,"rows_kept":105,"cut":false,"hidden":false,"merged":[]}
["SHORT DOC NB","SHORTNAME","SOURCE","UPLOADED","STATUS","DOC TYPE","VERS","MEETING"]
["REQ-2015-0589R01","Usecase on vehicle data wipe service","TOYOTA ITC","2015-07-07T11:35:50","Draft","INC",null,"REQ 18"]
["REQ-2015-0589R02","Usecase on vehicle data wipe service","TOYOTA ITC",null,"Draft","INC",null,"REQ 18"]
["REQ-2015-0589R03","Usecase on vehicle data wipe service","TOYOTA ITC","2015-07-20T07:12:26","Noted","INC",null,"REQ 18"]
["REQ-2015-0589R04","Usecase on vehicle data wipe service","TOYOTA ITC, KDDI, Fujitsu","2015-07-21T20:00:28","Agreed","INC",null,"REQ 18"]
["REQ-2015-0590","SEC_related_CR_to_TS-0002_on_Trust_transfer","NEC","2015-07-10T17:17:49","Draft","INC",null,"REQ 18"]
["REQ-2015-0590R01","SEC_related_CR_to_TS-0002_on_Trust_transfer","NEC","2015-07-22T14:17:03","Agreed","INC",null,"REQ 18"]
["REQ-2015-0590R02","SEC_related_CR_to_TS-0002_on_Trust_transfer","NEC","2015-07-23T15:37:14","Draft","INC",null,"REQ 18"]
["REQ-2015-0591","CR_to_TS-0002_on_dynamic_Verification_of_GW_Processing_Integrity","NEC","2015-07-10T17:37:28","Draft","INC",null,"REQ 18"]
["REQ-2015-0591R01","CR_to_TS-0002_on_dynamic_Verification_of_GW_Processing_Integrity","NEC","2015-07-17T15:13:40","Noted","INC",null,"REQ 18"]
["REQ-2015-0591R02","CR_to_TS-0002_on_dynamic_Verification_of_GW_Processing_Integrity","NEC","2015-07-23T15:41:38","Draft","INC",null,"REQ 18"]
["REQ-2015-0591R03","CR_to_TS-0002_on_dynamic_Verification_of_GW_Processing_Integrity","NEC","2015-07-23T16:51:57","Draft","INC",null,"REQ 18"]
["REQ-2015-0591R04","CR_to_TS-0002_on_dynamic_Verification_of_GW_Processing_Integrity","NEC","2015-07-23T18:56:48","Agreed","INC",null,"REQ 18"]
["REQ-2015-0592","Add App-ID Abbreviations and Definitions","Darold Hemphill - iconectiv","2015-07-10T18:54:44","Draft","CR",null,"REQ 18"]
["REQ-2015-0592R01","Add App-ID Abbreviations and Definitions","Darold Hemphill - iconectiv","2015-07-17T20:54:39","Draft","CR",null,"REQ 18"]
{"$rows_left_out":91}
{"sheet":"ARC","index":5,"n_rows":200,"n_cols":8,"rows_kept":200,"cut":false,"hidden":false,"merged":[]}
["SHORT DOC NB","SHORTNAME","SOURCE","UPLOADED","STATUS","DOC TYPE","VERS","MEETING"]
["ARC-2015-1902R01","CR_structured_resource_ID_clarification","LG Electronics","2015-07-13T09:07:33","Draft","CR",null,"ARC 18"]
["ARC-2015-1903R01","CR_structured_resource_ID_clarification(R2)","LG Electronics","2015-07-13T09:09:50","Draft","CR",null,"ARC 18"]
["ARC-2015-1934","CR CSEBase resource type (R1)","LG Electronics","2015-06-11T08:42:27","Agreed","CR",null,"ARC 18"]
["ARC-2015-1935","CR CSEBase resource type (R2)","LG Electronics","2015-06-11T08:43:53","Agreed","CR",null,"ARC 18"]
["ARC-2015-1940R01","CR for hostedCSEID attribute name correction","C-DOT","2015-06-25T05:51:19","Draft","CR",null,"ARC 18"]
["ARC-2015-1941","CR for serviceSubscribedNode - ruleLinks attribute","C-DOT (Anupama,Poornima)","2015-06-25T06:30:30","Draft","CR",null,"ARC 18"]
["ARC-2015-1942","CR for CRUD on m2mServiceSubscriptionProfile and serviceSubscribedNode","C-DOT (Anupama,Poornima)","2015-07-02T05:43:50","Draft","CR",null,"ARC 18"]
["ARC-2015-1944","Minutes ARC17-3","Karen Hughes, Secretariat","2015-07-02T15:08:23","Agreed","MIN",null,"ARC 18"]
["ARC-2015-1945","Simple word errors correction","LG Electronics","2015-07-03T09:36:47","Agreed","CR",null,"ARC 18"]
["ARC-2015-1946","TR-0014-oneM2M_and_AllJoyn_interworking-V0_4_0_Draft","LG Electronics","2015-07-08T05:24:56","Noted","INC",null,"ARC 18"]
["ARC-2015-1946R01","TR-0014-oneM2M_and_AllJoyn_interworking-V0_4_0_Draft","LG Electronics","2015-07-20T21:42:10","Draft","INC",null,"ARC 18"]
["ARC-2015-1947","Multiplicity correction to objectAttribute R1","Yongjing Zhang (Huawei)","2015-07-08T03:57:43","Draft","CR",null,"ARC 18"]
["ARC-2015-1948","Multiplicity correction to objectAttribute R2","Yongjing Zhang (Huawei)","2015-07-08T03:57:56","Draft","CR",null,"ARC 18"]
["ARC-2015-1949","Target-Notification-Disposition-Policy-Editorial-Enhancements","Ericsson","2015-07-10T12:14:12","Draft","CR",null,"ARC 18"]
{"$rows_left_out":186}
{"sheet":"PRO","index":6,"n_rows":103,"n_cols":8,"rows_kept":103,"cut":false,"hidden":false,"merged":[]}
["SHORT DOC NB","SHORTNAME","SOURCE","UPLOADED","STATUS","DOC TYPE","VERS","MEETING"]
["ARC-2015-1978","WebSocket registration procedure","FUJITSU",null,"Draft","CR",null,"PRO 18"]
["PRO-2015-0768R03","CR_parameter_default_values","LG Electronics","2015-06-11T08:30:01","Noted","CR",null,"PRO 18"]
["PRO-2015-0768R04","CR_parameter_default_values","LG Electronics","2015-07-21T20:36:51","Agreed","CR",null,"PRO 18"]
["PRO-2015-0779","Generic response procedure for receiver","KT","2015-05-10T13:33:20","Draft","CR",null,"PRO 18"]
["PRO-2015-0783R02","Clarification_on_XSD_usage","Qualcomm Inc. (TIA), FUJITSU","2015-06-05T19:57:22","Noted","CR",null,"PRO 18"]
["PRO-2015-0783R03","Clarification_on_XSD_usage","Qualcomm Inc. (TIA), FUJITSU","2015-07-23T15:26:24","Agreed","CR",null,"PRO 18"]
["PRO-2015-0792","Virtual_Resource_XSD_Correction","LG Electronics","2015-05-13T01:56:23","Noted","CR",null,"PRO 18"]
["PRO-2015-0808R01","CR_TS-0009_response_code_mapping_enhancement","LG Electronics","2015-07-03T06:13:42","Draft","CR",null,"PRO 18"]
["PRO-2015-0811R02","CR_TS0004_primitiveContent","Qualcomm Inc. (TIA)","2015-07-21T15:34:22","Draft","CR",null,"PRO 18"]
["PRO-2015-0815","CR schedule resource type","LG Electronics","2015-06-11T08:29:21","Agreed","CR",null,"PRO 18"]
["PRO-2015-0819R01","Step value syntax for scheduleElement","QUALCOMM","2015-06-30T15:12:16","Noted","CR",null,"PRO 18"]
["PRO-2015-0819R02","Step value syntax for scheduleElement","QUALCOMM","2015-07-20T21:47:19","Noted","CR",null,"PRO 18"]
["PRO-2015-0819R03","Step value syntax for scheduleElement","QUALCOMM","2015-07-21T14:25:31","Draft","CR",null,"PRO 18"]
["PRO-2015-0820R01","Draft_TS-0004_v.1.2.1","TS-0004 Rapportuers","2015-06-30T11:08:39","Reserved","INC",null,"PRO 18"]
{"$rows_left_out":89}
{"sheet":"SEC","index":7,"n_rows":51,"n_cols":8,"rows_kept":51,"cut":false,"hidden":false,"merged":[]}
["SHORT DOC NB","SHORTNAME","SOURCE","UPLOADED","STATUS","DOC TYPE","VERS","MEETING"]
["SEC-2015-0549R01","Certificate Enrolment STEs","Phil Hawkes, Qualcomm","2015-07-13T12:50:10","Noted","INC",null,"SEC 18"]
["SEC-2015-0549R02","Certificate Enrolment STEs","Phil Hawkes, Qualcomm","2015-07-20T08:40:10","Noted","INC",null,"SEC 18"]
["SEC-2015-0551","CR for naming correction in figures","C-DOT (Anupama,Poornima)","2015-07-08T06:13:26","Agreed","CR",null,"SEC 18"]
["SEC-2015-0552","CR for section reference corrections","C-DOT (Anupama,Poornima)","2015-07-08T06:37:11","Agreed","CR",null,"SEC 18"]
["SEC-2015-0553","SE reference point","Giesecke & Devrient","2015-07-08T07:54:36","Draft","INC",null,"SEC 18"]
["SEC-2015-0553R01","SE reference point","Giesecke & Devrient","2015-07-22T19:34:37","Draft","INC",null,"SEC 18"]
["SEC-2015-0554","SE abstraction architecture","Giesecke & Devrient","2015-07-08T07:55:21","Draft","INC",null,"SEC 18"]
["SEC-2015-0554R01","SE abstraction architecture","Giesecke & Devrient","2015-07-22T19:33:56","Draft","INC",null,"SEC 18"]
["SEC-2015-0555","Types of SEs","Giesecke & Devrient","2015-07-08T08:03:59","Draft","INC",null,"SEC 18"]
["SEC-2015-0555R01","Types of SEs","Giesecke & Devrient","2015-07-22T19:33:01","Draft","INC",null,"SEC 18"]
["SEC-2015-0556","CR for word correction provisioned to pre-provisioned","C-DOT (Suman,Poornima)","2015-07-08T09:20:56","Agreed","CR",null,"SEC 18"]
["SEC-2015-0557","TACML-PPM","BT Group","2015-07-12T12:27:29","Draft","INC",null,"SEC 18"]
["SEC-2015-0558","use-case-requirements-end-to-end-authentication-using-delegation","InterDigital","2015-07-13T02:18:05","Noted","CR",null,"SEC 18"]
["SEC-2015-0558R01","use-case-requirements-end-to-end-authentication-using-delegation","InterDigital","2015-07-22T22:15:51","Draft","CR",null,"SEC 18"]
{"$rows_left_out":37}
{"sheet":"MAS","index":8,"n_rows":44,"n_cols":8,"rows_kept":44,"cut":false,"hidden":false,"merged":[]}
["SHORT DOC NB","SHORTNAME","SOURCE","UPLOADED","STATUS","DOC TYPE","VERS","MEETING"]
["MAS-2015-0591","TS-0012-V0_3_0 Base Ontology update after MAS#17.3","NEC (rapporteur)","2015-07-07T10:23:36","Agreed","INC",null,"MAS 18"]
["MAS-2015-0592","Modeling M2M app data","FUJITSU","2015-07-12T02:39:38","Draft","INC",null,"MAS 18"]
["MAS-2015-0592R01","Modeling M2M app data","FUJITSU","2015-07-20T16:17:14","Draft","INC",null,"MAS 18"]
["MAS-2015-0593","TS-0005 Align Resource Names and Attributes","Gemalto N.V","2015-07-10T21:17:53","Draft","CR",null,"MAS 18"]
["MAS-2015-0593R01","TS-0005 Align Resource Names and Attributes","Gemalto N.V","2015-07-20T19:13:26","Agreed","CR",null,"MAS 18"]
["MAS-2015-0594","Discussions on semantic description  rules","China Unicom","2015-07-10T15:44:34","Draft","INC",null,"MAS 18"]
["MAS-2015-0595","TS-0012 Update on Base Ontology and Mapping to oneM2M Resources","NEC","2015-07-13T15:25:39","Draft","INC",null,"MAS 18"]
["MAS-2015-0595R01","TS-0012 Update on Base Ontology and Mapping to oneM2M Resources","NEC","2015-07-21T14:52:02","Draft","INC",null,"MAS 18"]
["MAS-2015-0595R02","TS-0012 Update on Base Ontology and Mapping to oneM2M Resources","NEC","2015-07-21T20:44:15","Draft","INC",null,"MAS 18"]
["MAS-2015-0595R03","TS-0012 Update on Base Ontology and Mapping to oneM2M Resources","NEC","2015-07-22T13:28:55","Draft","INC",null,"MAS 18"]
["MAS-2015-0595R04","TS-0012 Update on Base Ontology and Mapping to oneM2M Resources","NEC","2015-07-23T13:36:57","Draft","INC",null,"MAS 18"]
["MAS-2015-0595R05","TS-0012 Update on Base Ontology and Mapping to oneM2M Resources","NEC","2015-07-24T12:57:44","Draft","INC",null,"MAS 18"]
["MAS-2015-0595R06","TS-0012 Update on Base Ontology and Mapping to oneM2M Resources","NEC","2015-07-24T15:24:38","Draft","INC",null,"MAS 18"]
["MAS-2015-0595R07","TS-0012 Update on Base Ontology and Mapping to oneM2M Resources","NEC","2015-07-24T16:09:51","Draft","INC",null,"MAS 18"]
{"$rows_left_out":30}
{"sheet":"TST","index":9,"n_rows":56,"n_cols":8,"rows_kept":56,"cut":false,"hidden":false,"merged":[]}
["SHORT DOC NB","SHORTNAME","SOURCE","UPLOADED","STATUS","DOC TYPE","VERS","MEETING"]
["TST-2015-0117","TST_18_docs_allocation","TST WG Chair","2015-07-17T13:10:14","Draft","AG",null,"TST 18"]
["TST-2015-0117R01","TST_18_docs_allocation","TST WG Chair","2015-07-19T00:37:33","Draft","AG",null,"TST 18"]
["TST-2015-0117R02","TST_18_docs_allocation","TST WG Chair","2015-07-19T23:16:54","Draft","AG",null,"TST 18"]
["TST-2015-0117R03","TST_18_docs_allocation","TST WG Chair","2015-07-20T04:38:00","Draft","AG",null,"TST 18"]
["TST-2015-0117R04","TST_18_docs_allocation","TST WG Chair","2015-07-20T23:36:39","Draft","AG",null,"TST 18"]
["TST-2015-0117R05","TST_18_docs_allocation","TST WG Chair","2015-07-22T12:27:19","Draft","AG",null,"TST 18"]
["TST-2015-0118","TST-18-Agenda","TST WG Chair","2015-07-17T12:43:15","Draft","AG",null,"TST 18"]
["TST-2015-0118R01","TST-18-Agenda","TST WG Chair","2015-07-19T00:36:44","Draft","AG",null,"TST 18"]
["TST-2015-0118R02","TST-18-Agenda","TST WG Chair","2015-07-19T23:16:22","Draft","AG",null,"TST 18"]
["TST-2015-0119","draft TST WG progress report at TP18","TST WG Chair",null,"Draft","INC",null,"TST 18"]
["TST-2015-0123","ICS baseline v0.0.2","KETI","2015-07-08T13:47:03","Draft","INC",null,"TST 18"]
["TST-2015-0123R01","ICS baseline v0.0.2","KETI","2015-07-21T20:19:03","Draft","INC",null,"TST 18"]
["TST-2015-0124","Issues_pertaining_to_IOP_test","Huawei Technologies Co., Ltd.","2015-07-12T06:49:01","Noted","INC",null,"TST 18"]
["TST-2015-0124R01","Issues_pertaining_to_IOP_test","Huawei Technologies Co., Ltd.","2015-07-22T15:37:43","Draft","INC",null,"TST 18"]
{"$rows_left_out":41}