{"text_format":"1","workbook":"xlsx","n_sheets":10,"sheets":["Document Allocation","logistics","AllDocs","TP","REQ","ARC","PRO","SEC","MAS","TST"],"not_rendered":{"charts":0,"images":1,"macros":1,"external_links":0,"defined_names":14,"comments":0,"pivot_tables":0},"unopened":[],"bounds":{"document_bytes":16777216,"sheet_cells":100000,"rows_first":2000,"rows_last":500,"rows_between":2000,"halvings":0,"cell_chars":16384,"cell_head_chars":4096},"cells_cut":0,"cells_raw":0,"read":"whole","date_system":"1900"}

{"sheet":"Document Allocation","index":0,"n_rows":146,"n_cols":13,"rows_kept":146,"cut":false,"hidden":false,"merged":[]}
["Slot","WG",null,"Doc-Number","Title","Source","Upload Time","WG disposition (Agreed, Noted, Postponed, Withdrawn)","Type (INC, CR, AG, MIN)","Work Item","Rel","Purpose","Notes"]
["Mon-4 (15:30-17:00)",{"$f":"VLOOKUP(A2,logistics!G:I,2,0)","v":"MADRID 3"},{"$f":"VLOOKUP(A2,logistics!G:I,3,0)","v":"MAS"},"MAS-2017-0091",{"$f":"VLOOKUP(D2,AllDocs!A:D,2,0)","v":"MAS#29 Agenda"},{"$f":"VLOOKUP(D2,AllDocs!A:D,3,0)","v":"Yongjing Zhang (Huawei, MAS Chair)"},{"$f":"VLOOKUP(D2,AllDocs!A:D,4,0)","v":"2017-05-18T10:01:07"},"Noted",{"$f":"VLOOKUP(D2,AllDocs!A:F,6,0)","v":"AG"}]
["Mon-4 (15:30-17:00)",{"$f":"VLOOKUP(A3,logistics!G:I,2,0)","v":"MADRID 3"},{"$f":"VLOOKUP(A3,logistics!G:I,3,0)","v":"MAS"},"MAS-2017-0091R01",{"$f":"VLOOKUP(D3,AllDocs!A:D,2,0)","v":"MAS#29 Agenda"},{"$f":"VLOOKUP(D3,AllDocs!A:D,3,0)","v":"Yongjing Zhang (Huawei, MAS Chair)"},{"$f":"VLOOKUP(D3,AllDocs!A:D,4,0)","v":"2017-05-22T08:23:57"},"Agreed",{"$f":"VLOOKUP(D3,AllDocs!A:F,6,0)","v":"AG"}]
["Mon-4 (15:30-17:00)",{"$f":"VLOOKUP(A4,logistics!G:I,2,0)","v":"MADRID 3"},{"$f":"VLOOKUP(A4,logistics!G:I,3,0)","v":"MAS"},"MAS-2017-0092",{"$f":"VLOOKUP(D4,AllDocs!A:D,2,0)","v":"MAS#29 Doc allocation"},{"$f":"VLOOKUP(D4,AllDocs!A:D,3,0)","v":"Yongjing Zhang (Huawei, MAS Chair)"},{"$f":"VLOOKUP(D4,AllDocs!A:D,4,0)","v":"2017-05-18T10:00:55"},"Noted",{"$f":"VLOOKUP(D4,AllDocs!A:F,6,0)","v":"AG"}]
["Mon-4 (15:30-17:00)",{"$f":"VLOOKUP(A5,logistics!G:I,2,0)","v":"MADRID 3"},{"$f":"VLOOKUP(A5,logistics!G:I,3,0)","v":"MAS"},"MAS-2017-0120",{"$f":"VLOOKUP(D5,AllDocs!A:D,2,0)","v":"TS-0006-Management_enablement_(BBF)-V3_3_0-Draft-Baseline"},{"$f":"VLOOKUP(D5,AllDocs!A:D,3,0)","v":"Timothy Carey, Nokia"},{"$f":"VLOOKUP(D5,AllDocs!A:D,4,0)","v":"2017-05-16T13:25:49"},"Noted",{"$f":"VLOOKUP(D5,AllDocs!A:F,6,0)","v":"INC"},"TS-0006 (WI-0010)",3]
["Mon-4 (15:30-17:00)",{"$f":"VLOOKUP(A6,logistics!G:I,2,0)","v":"MADRID 3"},{"$f":"VLOOKUP(A6,logistics!G:I,3,0)","v":"MAS"},"MAS-2017-0120R01",{"$f":"VLOOKUP(D6,AllDocs!A:D,2,0)","v":"TS-0006-Management_enablement_(BBF)-V3_3_0-Draft-Baseline"},{"$f":"VLOOKUP(D6,AllDocs!A:D,3,0)","v":"Timothy Carey, Nokia"},{"$f":"VLOOKUP(D6,AllDocs!A:D,4,0)","v":"2017-05-22T08:05:16"},"Agreed",{"$f":"VLOOKUP(D6,AllDocs!A:F,6,0)","v":"INC"},"TS-0006 (WI-0010)",3]
["Mon-4 (15:30-17:00)",{"$f":"VLOOKUP(A7,logistics!G:I,2,0)","v":"MADRID 3"},{"$f":"VLOOKUP(A7,logistics!G:I,3,0)","v":"MAS"},"MAS-2017-0118",{"$f":"VLOOKUP(D7,AllDocs!A:D,2,0)","v":"LwM2M_Event_Log_Mapping"},{"$f":"VLOOKUP(D7,AllDocs!A:D,3,0)","v":"Huawei Technologies Co., Ltd."},{"$f":"VLOOKUP(D7,AllDocs!A:D,4,0)","v":"2017-05-15T09:02:53"},"Noted",{"$f":"VLOOKUP(D7,AllDocs!A:F,6,0)","v":"CR"},"TS-0005 (WI-0010)",3]
["Mon-4 (15:30-17:00)",{"$f":"VLOOKUP(A8,logistics!G:I,2,0)","v":"MADRID 3"},{"$f":"VLOOKUP(A8,logistics!G:I,3,0)","v":"MAS"},"MAS-2017-0118R01",{"$f":"VLOOKUP(D8,AllDocs!A:D,2,0)","v":"LwM2M_Event_Log_Mapping"},{"$f":"VLOOKUP(D8,AllDocs!A:D,3,0)","v":"Huawei Technologies Co., Ltd."},{"$f":"VLOOKUP(D8,AllDocs!A:D,4,0)","v":"2017-05-20T10:51:22"},"Noted",{"$f":"VLOOKUP(D8,AllDocs!A:F,6,0)","v":"CR"},"TS-0005 (WI-0010)",3]
["Mon-4 (15:30-17:00)",{"$f":"VLOOKUP(A9,logistics!G:I,2,0)","v":"MADRID 3"},{"$f":"VLOOKUP(A9,logistics!G:I,3,0)","v":"MAS"},"MAS-2017-0118R02",{"$f":"VLOOKUP(D9,AllDocs!A:D,2,0)","v":"LwM2M_Event_Log_Mapping"},{"$f":"VLOOKUP(D9,AllDocs!A:D,3,0)","v":"Huawei Technologies Co., Ltd."},{"$f":"VLOOKUP(D9,AllDocs!A:D,4,0)","v":"2017-05-22T03:47:11"},"Noted",{"$f":"VLOOKUP(D9,AllDocs!A:F,6,0)","v":"CR"},"TS-0005 (WI-0010)",3,null,"the detailed data type mapping needs to be aligned between TS-0004 and LwM2M resources.\nIt's ok to register to OMA from oneM2M perspective, and LS to OMA for comments.\nR03 Expected."]
["Mon-4 (15:30-17:00)",{"$f":"VLOOKUP(A10,logistics!G:I,2,0)","v":"MADRID 3"},{"$f":"VLOOKUP(A10,logistics!G:I,3,0)","v":"MAS"},"MAS-2017-0058R03",{"$f":"VLOOKUP(D10,AllDocs!A:D,2,0)","v":"Adding geoLocation to TS-0023"},{"$f":"VLOOKUP(D10,AllDocs!A:D,3,0)","v":"Andreas Kraft (Deutsche Telekom)"},{"$f":"VLOOKUP(D10,AllDocs!A:D,4,0)","v":"2017-05-03T11:56:14"},"Agreed",{"$f":"VLOOKUP(D10,AllDocs!A:F,6,0)","v":"CR"},"TS-0023 (WI-0056)",3]
["Mon-4 (15:30-17:00)",{"$f":"VLOOKUP(A11,logistics!G:I,2,0)","v":"MADRID 3"},{"$f":"VLOOKUP(A11,logistics!G:I,3,0)","v":"MAS"},"MAS-2017-0088",{"$f":"VLOOKUP(D11,AllDocs!A:D,2,0)","v":"Adding a new ModuleClass for retrieving and setting movement information"},{"$f":"VLOOKUP(D11,AllDocs!A:D,3,0)","v":"Andreas Kraft (Deutsche Telekom)"},{"$f":"VLOOKUP(D11,AllDocs!A:D,4,0)","v":"2017-05-03T11:55:16"},"Noted",{"$f":"VLOOKUP(D11,AllDocs!A:F,6,0)","v":"CR"},"TS-0023 (WI-0056)",3,null,"R01 expectd"]
["Mon-4 (15:30-17:00)",{"$f":"VLOOKUP(A12,logistics!G:I,2,0)","v":"MADRID 3"},{"$f":"VLOOKUP(A12,logistics!G:I,3,0)","v":"MAS"},"MAS-2017-0087",{"$f":"VLOOKUP(D12,AllDocs!A:D,2,0)","v":"Discussion on current and target data points"},{"$f":"VLOOKUP(D12,AllDocs!A:D,3,0)","v":"Andreas Kraft (Deutsche Telekom)"},{"$f":"VLOOKUP(D12,AllDocs!A:D,4,0)","v":"2017-05-03T11:53:47"},"Noted",{"$f":"VLOOKUP(D12,AllDocs!A:F,6,0)","v":"INC"},"TS-0023 (WI-0056)",3,"Discussion","AI: Andreas: to review existing module classes to see any need to distinguish current and target status (only if necessary)"]
["Mon-4 (15:30-17:00)",{"$f":"VLOOKUP(A13,logistics!G:I,2,0)","v":"MADRID 3"},{"$f":"VLOOKUP(A13,logistics!G:I,3,0)","v":"MAS"},"MAS-2017-0095",{"$f":"VLOOKUP(D13,AllDocs!A:D,2,0)","v":"Adding_omaDevice_module _to_TS-0023"},{"$f":"VLOOKUP(D13,AllDocs!A:D,3,0)","v":"NTT"},{"$f":"VLOOKUP(D13,AllDocs!A:D,4,0)","v":"2017-05-12T09:08:39"},"Noted",{"$f":"VLOOKUP(D13,AllDocs!A:F,6,0)","v":"CR"},"TS-0023 (WI-0056)",3,null,"R01 expectd"]
["Mon-5 (17:00-18:30)",{"$f":"VLOOKUP(A14,logistics!G:I,2,0)","v":"MADRID 5 "},{"$f":"VLOOKUP(A14,logistics!G:I,3,0)","v":"MAS-adhoc"},"MAS-2017-0102",{"$f":"VLOOKUP(D14,AllDocs!A:D,2,0)","v":"HAIM_modification_for_airPurifier_model"},{"$f":"VLOOKUP(D14,AllDocs!A:D,3,0)","v":"LG Electronics"},{"$f":"VLOOKUP(D14,AllDocs!A:D,4,0)","v":"2017-05-15T06:01:49"},null,{"$f":"VLOOKUP(D14,AllDocs!A:F,6,0)","v":"CR"},"TS-0023 (WI-0056)",3,null,"ready to go"]
["Mon-5 (17:00-18:30)",{"$f":"VLOOKUP(A15,logistics!G:I,2,0)","v":"MADRID 5 "},{"$f":"VLOOKUP(A15,logistics!G:I,3,0)","v":"MAS-adhoc"},"MAS-2017-0103",{"$f":"VLOOKUP(D15,AllDocs!A:D,2,0)","v":"HAIM_modification_for_airQualityMon_model"},{"$f":"VLOOKUP(D15,AllDocs!A:D,3,0)","v":"LG Electronics"},{"$f":"VLOOKUP(D15,AllDocs!A:D,4,0)","v":"2017-05-16T06:59:50"},null,{"$f":"VLOOKUP(D15,AllDocs!A:F,6,0)","v":"CR"},"TS-0023 (WI-0056)",3,null,"ready to go"]
["Mon-5 (17:00-18:30)",{"$f":"VLOOKUP(A16,logistics!G:I,2,0)","v":"MADRID 5 "},{"$f":"VLOOKUP(A16,logistics!G:I,3,0)","v":"MAS-adhoc"},"MAS-2017-0104",{"$f":"VLOOKUP(D16,AllDocs!A:D,2,0)","v":"HAIM_modification_for_dehumidifier_model"},{"$f":"VLOOKUP(D16,AllDocs!A:D,3,0)","v":"LG Electronics"},{"$f":"VLOOKUP(D16,AllDocs!A:D,4,0)","v":"2017-05-15T06:18:35"},null,{"$f":"VLOOKUP(D16,AllDocs!A:F,6,0)","v":"CR"},"TS-0023 (WI-0056)",3,null,"R01 expected to update 'intro'"]
["Mon-5 (17:00-18:30)",{"$f":"VLOOKUP(A17,logistics!G:I,2,0)","v":"MADRID 5 "},{"$f":"VLOOKUP(A17,logistics!G:I,3,0)","v":"MAS-adhoc"},"MAS-2017-0106",{"$f":"VLOOKUP(D17,AllDocs!A:D,2,0)","v":"HAIM_modification_for_freezer_model"},{"$f":"VLOOKUP(D17,AllDocs!A:D,3,0)","v":"LG Electronics"},{"$f":"VLOOKUP(D17,AllDocs!A:D,4,0)","v":"2017-05-15T07:03:16"},null,{"$f":"VLOOKUP(D17,AllDocs!A:F,6,0)","v":"CR"},"TS-0023 (WI-0056)",3,null,"consider to merge with deviceRefrigrator"]
["Mon-5 (17:00-18:30)",{"$f":"VLOOKUP(A18,logistics!G:I,2,0)","v":"MADRID 5 "},{"$f":"VLOOKUP(A18,logistics!G:I,3,0)","v":"MAS-adhoc"},"MAS-2017-0107",{"$f":"VLOOKUP(D18,AllDocs!A:D,2,0)","v":"HAIM_modification_for_printMultiFunction_model"},{"$f":"VLOOKUP(D18,AllDocs!A:D,3,0)","v":"LG Electronics"},{"$f":"VLOOKUP(D18,AllDocs!A:D,4,0)","v":"2017-05-15T08:12:27"},null,{"$f":"VLOOKUP(D18,AllDocs!A:F,6,0)","v":"CR"},"TS-0023 (WI-0056)",3,null,"R01 expected. printRunState should be mandatory."]
["Mon-5 (17:00-18:30)",{"$f":"VLOOKUP(A19,logistics!G:I,2,0)","v":"MADRID 5 "},{"$f":"VLOOKUP(A19,logistics!G:I,3,0)","v":"MAS-adhoc"},"MAS-2017-0108",{"$f":"VLOOKUP(D19,AllDocs!A:D,2,0)","v":"HAIM_modification_for_clothesDryer_model"},{"$f":"VLOOKUP(D19,AllDocs!A:D,3,0)","v":"LG Electronics"},{"$f":"VLOOKUP(D19,AllDocs!A:D,4,0)","v":"2017-05-15T06:02:26"},null,{"$f":"VLOOKUP(D19,AllDocs!A:F,6,0)","v":"CR"},"TS-0023 (WI-0056)",3,null,"ready to go"]
["Mon-5 (17:00-18:30)",{"$f":"VLOOKUP(A20,logistics!G:I,2,0)","v":"MADRID 5 "},{"$f":"VLOOKUP(A20,logistics!G:I,3,0)","v":"MAS-adhoc"},"MAS-2017-0109",{"$f":"VLOOKUP(D20,AllDocs!A:D,2,0)","v":"HAIM_modification_for_TV_model"},{"$f":"VLOOKUP(D20,AllDocs!A:D,3,0)","v":"LG Electronics"},{"$f":"VLOOKUP(D20,AllDocs!A:D,4,0)","v":"2017-05-15T06:03:00"},null,{"$f":"VLOOKUP(D20,AllDocs!A:F,6,0)","v":"CR"},"TS-0023 (WI-0056)",3,null,"R01 expected. \nAI: to review the enumeration of states regarding the word form (verb vs infinite..) through out the TS-0023"]
["Mon-5 (17:00-18:30)",{"$f":"VLOOKUP(A21,logistics!G:I,2,0)","v":"MADRID 5 "},{"$f":"VLOOKUP(A21,logistics!G:I,3,0)","v":"MAS-adhoc"},"MAS-2017-0114",{"$f":"VLOOKUP(D21,AllDocs!A:D,2,0)","v":"HAIM modification for food prove model"},{"$f":"VLOOKUP(D21,AllDocs!A:D,3,0)","v":"QUALCOMM Inc. (TIA)"},{"$f":"VLOOKUP(D21,AllDocs!A:D,4,0)","v":"2017-05-19T05:48:54"},null,{"$f":"VLOOKUP(D21,AllDocs!A:F,6,0)","v":"CR"},"TS-0023 (WI-0056)",3,null,"R01 expected to update xsd table."]
["Mon-5 (17:00-18:30)",{"$f":"VLOOKUP(A22,logistics!G:I,2,0)","v":"MADRID 5 "},{"$f":"VLOOKUP(A22,logistics!G:I,3,0)","v":"MAS-adhoc"},"MAS-2017-0111",{"$f":"VLOOKUP(D22,AllDocs!A:D,2,0)","v":"HAIM modification for scanner model"},{"$f":"VLOOKUP(D22,AllDocs!A:D,3,0)","v":"QUALCOMM Inc. (TIA)"},{"$f":"VLOOKUP(D22,AllDocs!A:D,4,0)","v":"2017-05-22T08:29:01"},null,{"$f":"VLOOKUP(D22,AllDocs!A:F,6,0)","v":"CR"},"TS-0023 (WI-0056)",3,null,"R01 expected to remove duplicated content provided in 0107"]
["Mon-5 (17:00-18:30)",{"$f":"VLOOKUP(A23,logistics!G:I,2,0)","v":"MADRID 5 "},{"$f":"VLOOKUP(A23,logistics!G:I,3,0)","v":"MAS-adhoc"},"MAS-2017-0115",{"$f":"VLOOKUP(D23,AllDocs!A:D,2,0)","v":"HAIM modification for set top box model"},{"$f":"VLOOKUP(D23,AllDocs!A:D,3,0)","v":"QUALCOMM Inc. (TIA)"},{"$f":"VLOOKUP(D23,AllDocs!A:D,4,0)","v":"2017-05-19T05:11:14"},null,{"$f":"VLOOKUP(D23,AllDocs!A:F,6,0)","v":"CR"},"TS-0023 (WI-0056)",3,null,"R01 expected to add meaningful module classes."]
["Mon-5 (17:00-18:30)",{"$f":"VLOOKUP(A24,logistics!G:I,2,0)","v":"MADRID 5 "},{"$f":"VLOOKUP(A24,logistics!G:I,3,0)","v":"MAS-adhoc"},"MAS-2017-0110",{"$f":"VLOOKUP(D24,AllDocs!A:D,2,0)","v":"HAIM modification for receiver model"},{"$f":"VLOOKUP(D24,AllDocs!A:D,3,0)","v":"QUALCOMM Inc. (TIA)"},{"$f":"VLOOKUP(D24,AllDocs!A:D,4,0)","v":"2017-05-22T09:28:18"},null,{"$f":"VLOOKUP(D24,AllDocs!A:F,6,0)","v":"CR"},"TS-0023 (WI-0056)",3,null,"R01 expected."]
["Tue-2 (10:30-12:00)",{"$f":"VLOOKUP(A25,logistics!G:I,2,0)","v":"MADRID 3"},{"$f":"VLOOKUP(A25,logistics!G:I,3,0)","v":"MAS"},"MAS-2017-0094",{"$f":"VLOOKUP(D25,AllDocs!A:D,2,0)","v":"WoT Interworking Background for TR-0042"},{"$f":"VLOOKUP(D25,AllDocs!A:D,3,0)","v":"Convida, Huawei"},{"$f":"VLOOKUP(D25,AllDocs!A:D,4,0)","v":"2017-05-11T17:36:23"},"Noted",{"$f":"VLOOKUP(D25,AllDocs!A:F,6,0)","v":"CR"},"TR-0042 (WI-0071)",3,null,"AI: Yongjing: contact editHelp to make sure how to deal with the copyright issue with W3C, and whether it's allowed to copy content from W3C.\nR01 expected."]
["Tue-2 (10:30-12:00)",{"$f":"VLOOKUP(A26,logistics!G:I,2,0)","v":"MADRID 3"},{"$f":"VLOOKUP(A26,logistics!G:I,3,0)","v":"MAS"},"MAS-2017-0093",{"$f":"VLOOKUP(D26,AllDocs!A:D,2,0)","v":"WoT Interworking Scenarios"},{"$f":"VLOOKUP(D26,AllDocs!A:D,3,0)","v":"Yongjing Zhang (Huawei)"},{"$f":"VLOOKUP(D26,AllDocs!A:D,4,0)","v":"2017-05-10T15:45:57"},"Noted",{"$f":"VLOOKUP(D26,AllDocs!A:F,6,0)","v":"INC"},"TR-0042 (WI-0071)",3]
["Tue-2 (10:30-12:00)",{"$f":"VLOOKUP(A27,logistics!G:I,2,0)","v":"MADRID 3"},{"$f":"VLOOKUP(A27,logistics!G:I,3,0)","v":"MAS"},"MAS-2017-0093R01",{"$f":"VLOOKUP(D27,AllDocs!A:D,2,0)","v":"WoT Interworking Scenarios"},{"$f":"VLOOKUP(D27,AllDocs!A:D,3,0)","v":"Yongjing Zhang (Huawei)"},{"$f":"VLOOKUP(D27,AllDocs!A:D,4,0)","v":"2017-05-19T04:22:32"},"Agreed",{"$f":"VLOOKUP(D27,AllDocs!A:F,6,0)","v":"INC"},"TR-0042 (WI-0071)",3,null,"COMMENTS: different views on the values of the 2 scenarios."]
["Tue-2 (10:30-12:00)",{"$f":"VLOOKUP(A28,logistics!G:I,2,0)","v":"MADRID 3"},{"$f":"VLOOKUP(A28,logistics!G:I,3,0)","v":"MAS"},"MAS-2017-0096",{"$f":"VLOOKUP(D28,AllDocs!A:D,2,0)","v":"Semantic Mashup for TS-0034"},{"$f":"VLOOKUP(D28,AllDocs!A:D,3,0)","v":"Convida"},{"$f":"VLOOKUP(D28,AllDocs!A:D,4,0)","v":"2017-05-12T13:36:37"},null,{"$f":"VLOOKUP(D28,AllDocs!A:F,6,0)","v":"CR"},"TS-0034 (WI-0053)",3,null,"no technical concern. keep open until the question is addressed: should all new resource types go to TS-0001/4? need to consult with ARC/PRO."]
["Tue-4 (15:30-17:00)",{"$f":"VLOOKUP(A29,logistics!G:I,2,0)","v":"MADRID 3"},{"$f":"VLOOKUP(A29,logistics!G:I,3,0)","v":"MAS"},"MAS-2017-0097",{"$f":"VLOOKUP(D29,AllDocs!A:D,2,0)","v":"Request Parameter for Semantic Query for TR-0033"},{"$f":"VLOOKUP(D29,AllDocs!A:D,3,0)","v":"Convida"},{"$f":"VLOOKUP(D29,AllDocs!A:D,4,0)","v":"2017-05-12T17:01:20"},"Withdrawn",{"$f":"VLOOKUP(D29,AllDocs!A:F,6,0)","v":"CR"},"TR-0033 (WI-0053)",3]
["Tue-4 (15:30-17:00)",{"$f":"VLOOKUP(A30,logistics!G:I,2,0)","v":"MADRID 3"},{"$f":"VLOOKUP(A30,logistics!G:I,3,0)","v":"MAS"},"MAS-2017-0118R03",{"$f":"VLOOKUP(D30,AllDocs!A:D,2,0)","v":"LwM2M_Event_Log_Mapping"},{"$f":"VLOOKUP(D30,AllDocs!A:D,3,0)","v":"Huawei Technologies Co., Ltd."},{"$f":"VLOOKUP(D30,AllDocs!A:D,4,0)","v":"2017-05-23T07:24:19"},"Noted",{"$f":"VLOOKUP(D30,AllDocs!A:F,6,0)","v":"CR"},"TS-0005 (WI-0010)",3,null,"editorial: unknown\n\"lwm2m definition can be found in xx. The value of xx defined by LwM2M is not used.\"\nCaptialization of 'LogData'.\nthe encoding of LogData is implementation specific --> put it to the LogData Object defintion.\narguments defined by LwM2M is implementation specific\nR04 expected."]
["Tue-4 (15:30-17:00)",{"$f":"VLOOKUP(A31,logistics!G:I,2,0)","v":"MADRID 3"},{"$f":"VLOOKUP(A31,logistics!G:I,3,0)","v":"MAS"},"MAS-2017-0116",{"$f":"VLOOKUP(D31,AllDocs!A:D,2,0)","v":"CR TS-0012 minor corrections to the base ontology"},{"$f":"VLOOKUP(D31,AllDocs!A:D,3,0)","v":"NEC"},{"$f":"VLOOKUP(D31,AllDocs!A:D,4,0)","v":"2017-05-15T12:33:18"},"Agreed",{"$f":"VLOOKUP(D31,AllDocs!A:F,6,0)","v":"AG"},"TS-0012 (WI-0063)",3]
["Tue-4 (15:30-17:00)",{"$f":"VLOOKUP(A32,logistics!G:I,2,0)","v":"MADRID 3"},{"$f":"VLOOKUP(A32,logistics!G:I,3,0)","v":"MAS"},"MAS-2017-0117",{"$f":"VLOOKUP(D32,AllDocs!A:D,2,0)","v":"New type definitions for Generic Interworking"},{"$f":"VLOOKUP(D32,AllDocs!A:D,3,0)","v":"NEC"},{"$f":"VLOOKUP(D32,AllDocs!A:D,4,0)","v":"2017-05-19T21:19:53"},"Noted",{"$f":"VLOOKUP(D32,AllDocs!A:F,6,0)","v":"INC"},null,null,null,"The group agrees with the 'strutured datatype' approach, and sees several benefits.\nShould avoid using 'release 2/3', instead give meaningful names to differetn variants.\nlistItem and listNumber of listItem needs further study.\nR01 expected."]
["Tue-4 (15:30-17:00)",{"$f":"VLOOKUP(A33,logistics!G:I,2,0)","v":"MADRID 3"},{"$f":"VLOOKUP(A33,logistics!G:I,3,0)","v":"MAS"},"MAS-2017-0115",{"$f":"VLOOKUP(D33,AllDocs!A:D,2,0)","v":"HAIM modification for set top box model"},{"$f":"VLOOKUP(D33,AllDocs!A:D,3,0)","v":"QUALCOMM Inc. (TIA)"},{"$f":"VLOOKUP(D33,AllDocs!A:D,4,0)","v":"2017-05-19T05:11:14"},"Noted",{"$f":"VLOOKUP(D33,AllDocs!A:F,6,0)","v":"CR"},"TS-0023 (WI-0056)",3]
["Tue-4 (15:30-17:00)",{"$f":"VLOOKUP(A34,logistics!G:I,2,0)","v":"MADRID 3"},{"$f":"VLOOKUP(A34,logistics!G:I,3,0)","v":"MAS"},"MAS-2017-0115R01",{"$f":"VLOOKUP(D34,AllDocs!A:D,2,0)","v":"HAIM modification for set top box model"},{"$f":"VLOOKUP(D34,AllDocs!A:D,3,0)","v":"QUALCOMM Inc. (TIA)"},{"$f":"VLOOKUP(D34,AllDocs!A:D,4,0)","v":"2017-05-23T03:27:19"},"Noted",{"$f":"VLOOKUP(D34,AllDocs!A:F,6,0)","v":"CR"},"TS-0023 (WI-0056)",3,null,"R02 expected"]
["Tue-4 (15:30-17:00)",{"$f":"VLOOKUP(A35,logistics!G:I,2,0)","v":"MADRID 3"},{"$f":"VLOOKUP(A35,logistics!G:I,3,0)","v":"MAS"},"MAS-2017-0114",{"$f":"VLOOKUP(D35,AllDocs!A:D,2,0)","v":"HAIM modification for food prove model"},{"$f":"VLOOKUP(D35,AllDocs!A:D,3,0)","v":"QUALCOMM Inc. (TIA)"},{"$f":"VLOOKUP(D35,AllDocs!A:D,4,0)","v":"2017-05-19T05:48:54"},"Noted",{"$f":"VLOOKUP(D35,AllDocs!A:F,6,0)","v":"CR"},"TS-0023 (WI-0056)",3]
["Tue-4 (15:30-17:00)",{"$f":"VLOOKUP(A36,logistics!G:I,2,0)","v":"MADRID 3"},{"$f":"VLOOKUP(A36,logistics!G:I,3,0)","v":"MAS"},"MAS-2017-0114R01",{"$f":"VLOOKUP(D36,AllDocs!A:D,2,0)","v":"HAIM modification for food prove model"},{"$f":"VLOOKUP(D36,AllDocs!A:D,3,0)","v":"QUALCOMM Inc. (TIA)"},{"$f":"VLOOKUP(D36,AllDocs!A:D,4,0)","v":"2017-05-23T03:21:46"},"Agreed",{"$f":"VLOOKUP(D36,AllDocs!A:F,6,0)","v":"CR"},"TS-0023 (WI-0056)",3]
["Tue-4 (15:30-17:00)",{"$f":"VLOOKUP(A37,logistics!G:I,2,0)","v":"MADRID 3"},{"$f":"VLOOKUP(A37,logistics!G:I,3,0)","v":"MAS"},"MAS-2017-0111",{"$f":"VLOOKUP(D37,AllDocs!A:D,2,0)","v":"HAIM modification for scanner model"},{"$f":"VLOOKUP(D37,AllDocs!A:D,3,0)","v":"QUALCOMM Inc. (TIA)"},{"$f":"VLOOKUP(D37,AllDocs!A:D,4,0)","v":"2017-05-22T08:29:01"},"Noted",{"$f":"VLOOKUP(D37,AllDocs!A:F,6,0)","v":"CR"},"TS-0023 (WI-0056)",3]
["Tue-4 (15:30-17:00)",{"$f":"VLOOKUP(A38,logistics!G:I,2,0)","v":"MADRID 3"},{"$f":"VLOOKUP(A38,logistics!G:I,3,0)","v":"MAS"},"MAS-2017-0111R01",{"$f":"VLOOKUP(D38,AllDocs!A:D,2,0)","v":"HAIM modification for scanner model"},{"$f":"VLOOKUP(D38,AllDocs!A:D,3,0)","v":"QUALCOMM Inc. (TIA)"},{"$f":"VLOOKUP(D38,AllDocs!A:D,4,0)","v":"2017-05-23T03:22:14"},"Agreed",{"$f":"VLOOKUP(D38,AllDocs!A:F,6,0)","v":"CR"},"TS-0023 (WI-0056)",3]
["Tue-4 (15:30-17:00)",{"$f":"VLOOKUP(A39,logistics!G:I,2,0)","v":"MADRID 3"},{"$f":"VLOOKUP(A39,logistics!G:I,3,0)","v":"MAS"},"MAS-2017-0087",{"$f":"VLOOKUP(D39,AllDocs!A:D,2,0)","v":"Discussion on current and target data points"},{"$f":"VLOOKUP(D39,AllDocs!A:D,3,0)","v":"Andreas Kraft (Deutsche Telekom)"},{"$f":"VLOOKUP(D39,AllDocs!A:D,4,0)","v":"2017-05-03T11:53:47"},"Noted",{"$f":"VLOOKUP(D39,AllDocs!A:F,6,0)","v":"INC"},"TS-0023 (WI-0056)",3,"Discussion"]
["Tue-4 (15:30-17:00)",{"$f":"VLOOKUP(A40,logistics!G:I,2,0)","v":"MADRID 3"},{"$f":"VLOOKUP(A40,logistics!G:I,3,0)","v":"MAS"},"MAS-2017-0088",{"$f":"VLOOKUP(D40,AllDocs!A:D,2,0)","v":"Adding a new ModuleClass for retrieving and setting movement information"},{"$f":"VLOOKUP(D40,AllDocs!A:D,3,0)","v":"Andreas Kraft (Deutsche Telekom)"},{"$f":"VLOOKUP(D40,AllDocs!A:D,4,0)","v":"2017-05-03T11:55:16"},"Noted",{"$f":"VLOOKUP(D40,AllDocs!A:F,6,0)","v":"CR"},"TS-0023 (WI-0056)",3]
["Tue-4 (15:30-17:00)",{"$f":"VLOOKUP(A41,logistics!G:I,2,0)","v":"MADRID 3"},{"$f":"VLOOKUP(A41,logistics!G:I,3,0)","v":"MAS"},"MAS-2017-0088R01",{"$f":"VLOOKUP(D41,AllDocs!A:D,2,0)","v":"Adding a new ModuleClass for retrieving and setting movement information"},{"$f":"VLOOKUP(D41,AllDocs!A:D,3,0)","v":"Andreas Kraft (Deutsche Telekom)"},{"$f":"VLOOKUP(D41,AllDocs!A:D,4,0)","v":"2017-05-23T04:07:43"},"Noted",{"$f":"VLOOKUP(D41,AllDocs!A:F,6,0)","v":"CR"},"TS-0023 (WI-0056)",3,null,"R02 Expected."]
["Tue-4 (15:30-17:00)",{"$f":"VLOOKUP(A42,logistics!G:I,2,0)","v":"MADRID 3"},{"$f":"VLOOKUP(A42,logistics!G:I,3,0)","v":"MAS"},"MAS-2017-0102",{"$f":"VLOOKUP(D42,AllDocs!A:D,2,0)","v":"HAIM_modification_for_airPurifier_model"},{"$f":"VLOOKUP(D42,AllDocs!A:D,3,0)","v":"LG Electronics"},{"$f":"VLOOKUP(D42,AllDocs!A:D,4,0)","v":"2017-05-15T06:01:49"},"Agreed",{"$f":"VLOOKUP(D42,AllDocs!A:F,6,0)","v":"CR"},"TS-0023 (WI-0056)",3]
["Tue-4 (15:30-17:00)",{"$f":"VLOOKUP(A43,logistics!G:I,2,0)","v":"MADRID 3"},{"$f":"VLOOKUP(A43,logistics!G:I,3,0)","v":"MAS"},"MAS-2017-0103",{"$f":"VLOOKUP(D43,AllDocs!A:D,2,0)","v":"HAIM_modification_for_airQualityMon_model"},{"$f":"VLOOKUP(D43,AllDocs!A:D,3,0)","v":"LG Electronics"},{"$f":"VLOOKUP(D43,AllDocs!A:D,4,0)","v":"2017-05-16T06:59:50"},"Agreed",{"$f":"VLOOKUP(D43,AllDocs!A:F,6,0)","v":"CR"},"TS-0023 (WI-0056)",3]
["Tue-4 (15:30-17:00)",{"$f":"VLOOKUP(A44,logistics!G:I,2,0)","v":"MADRID 3"},{"$f":"VLOOKUP(A44,logistics!G:I,3,0)","v":"MAS"},"MAS-2017-0104",{"$f":"VLOOKUP(D44,AllDocs!A:D,2,0)","v":"HAIM_modification_for_dehumidifier_model"},{"$f":"VLOOKUP(D44,AllDocs!A:D,3,0)","v":"LG Electronics"},{"$f":"VLOOKUP(D44,AllDocs!A:D,4,0)","v":"2017-05-15T06:18:35"},"Noted",{"$f":"VLOOKUP(D44,AllDocs!A:F,6,0)","v":"CR"},"TS-0023 (WI-0056)",3]
["Tue-4 (15:30-17:00)",{"$f":"VLOOKUP(A45,logistics!G:I,2,0)","v":"MADRID 3"},{"$f":"VLOOKUP(A45,logistics!G:I,3,0)","v":"MAS"},"MAS-2017-0104R01",{"$f":"VLOOKUP(D45,AllDocs!A:D,2,0)","v":"HAIM_modification_for_dehumidifier_model"},{"$f":"VLOOKUP(D45,AllDocs!A:D,3,0)","v":"LG Electronics"},{"$f":"VLOOKUP(D45,AllDocs!A:D,4,0)","v":"2017-05-23T03:30:48"},"Agreed",{"$f":"VLOOKUP(D45,AllDocs!A:F,6,0)","v":"CR"},"TS-0023 (WI-0056)",3]
["Tue-4 (15:30-17:00)",{"$f":"VLOOKUP(A46,logistics!G:I,2,0)","v":"MADRID 3"},{"$f":"VLOOKUP(A46,logistics!G:I,3,0)","v":"MAS"},"MAS-2017-0106",{"$f":"VLOOKUP(D46,AllDocs!A:D,2,0)","v":"HAIM_modification_for_freezer_model"},{"$f":"VLOOKUP(D46,AllDocs!A:D,3,0)","v":"LG Electronics"},{"$f":"VLOOKUP(D46,AllDocs!A:D,4,0)","v":"2017-05-15T07:03:16"},"Noted",{"$f":"VLOOKUP(D46,AllDocs!A:F,6,0)","v":"CR"},"TS-0023 (WI-0056)",3,null,"R01 expected to update existing device refrigrator."]
["Tue-4 (15:30-17:00)",{"$f":"VLOOKUP(A47,logistics!G:I,2,0)","v":"MADRID 3"},{"$f":"VLOOKUP(A47,logistics!G:I,3,0)","v":"MAS"},"MAS-2017-0107",{"$f":"VLOOKUP(D47,AllDocs!A:D,2,0)","v":"HAIM_modification_for_printMultiFunction_model"},{"$f":"VLOOKUP(D47,AllDocs!A:D,3,0)","v":"LG Electronics"},{"$f":"VLOOKUP(D47,AllDocs!A:D,4,0)","v":"2017-05-15T08:12:27"},"Noted",{"$f":"VLOOKUP(D47,AllDocs!A:F,6,0)","v":"CR"},"TS-0023 (WI-0056)",3]
["Tue-4 (15:30-17:00)",{"$f":"VLOOKUP(A48,logistics!G:I,2,0)","v":"MADRID 3"},{"$f":"VLOOKUP(A48,logistics!G:I,3,0)","v":"MAS"},"MAS-2017-0107R01",{"$f":"VLOOKUP(D48,AllDocs!A:D,2,0)","v":"HAIM_modification_for_printMultiFunction_model"},{"$f":"VLOOKUP(D48,AllDocs!A:D,3,0)","v":"LG Electronics"},{"$f":"VLOOKUP(D48,AllDocs!A:D,4,0)","v":"2017-05-23T03:31:37"},"Agreed",{"$f":"VLOOKUP(D48,AllDocs!A:F,6,0)","v":"CR"},"TS-0023 (WI-0056)",3]
["Tue-4 (15:30-17:00)",{"$f":"VLOOKUP(A49,logistics!G:I,2,0)","v":"MADRID 3"},{"$f":"VLOOKUP(A49,logistics!G:I,3,0)","v":"MAS"},"MAS-2017-0108",{"$f":"VLOOKUP(D49,AllDocs!A:D,2,0)","v":"HAIM_modification_for_clothesDryer_model"},{"$f":"VLOOKUP(D49,AllDocs!A:D,3,0)","v":"LG Electronics"},{"$f":"VLOOKUP(D49,AllDocs!A:D,4,0)","v":"2017-05-15T06:02:26"},"Agreed",{"$f":"VLOOKUP(D49,AllDocs!A:F,6,0)","v":"CR"},"TS-0023 (WI-0056)",3]
["Tue-4 (15:30-17:00)",{"$f":"VLOOKUP(A50,logistics!G:I,2,0)","v":"MADRID 3"},{"$f":"VLOOKUP(A50,logistics!G:I,3,0)","v":"MAS"},"MAS-2017-0109",{"$f":"VLOOKUP(D50,AllDocs!A:D,2,0)","v":"HAIM_modification_for_TV_model"},{"$f":"VLOOKUP(D50,AllDocs!A:D,3,0)","v":"LG Electronics"},{"$f":"VLOOKUP(D50,AllDocs!A:D,4,0)","v":"2017-05-15T06:03:00"},"Noted",{"$f":"VLOOKUP(D50,AllDocs!A:F,6,0)","v":"CR"},"TS-0023 (WI-0056)",3]
["Tue-4 (15:30-17:00)",{"$f":"VLOOKUP(A51,logistics!G:I,2,0)","v":"MADRID 3"},{"$f":"VLOOKUP(A51,logistics!G:I,3,0)","v":"MAS"},"MAS-2017-0109R01",{"$f":"VLOOKUP(D51,AllDocs!A:D,2,0)","v":"HAIM_modification_for_TV_model"},{"$f":"VLOOKUP(D51,AllDocs!A:D,3,0)","v":"LG Electronics"},{"$f":"VLOOKUP(D51,AllDocs!A:D,4,0)","v":"2017-05-23T03:33:00"},"Noted",{"$f":"VLOOKUP(D51,AllDocs!A:F,6,0)","v":"CR"},"TS-0023 (WI-0056)",3,null,"one more output module class should be added.\n\nR02 expected."]
["Tue-5 (17:00-18:30)",{"$f":"VLOOKUP(A52,logistics!G:I,2,0)","v":"MADRID 2"},{"$f":"VLOOKUP(A52,logistics!G:I,3,0)","v":"ARC/MAS"},"MAS-2017-0100",{"$f":"VLOOKUP(D52,AllDocs!A:D,2,0)","v":"Guidelines_for_Mapping_ LWM2M_Objects"},{"$f":"VLOOKUP(D52,AllDocs!A:D,3,0)","v":"Convida"},{"$f":"VLOOKUP(D52,AllDocs!A:D,4,0)","v":"2017-05-12T18:49:57"},"Noted",{"$f":"VLOOKUP(D52,AllDocs!A:F,6,0)","v":"CR"},"TS-0005 (WI-0010)",3]
["Tue-5 (17:00-18:30)",{"$f":"VLOOKUP(A53,logistics!G:I,2,0)","v":"MADRID 2"},{"$f":"VLOOKUP(A53,logistics!G:I,3,0)","v":"ARC/MAS"},"MAS-2017-0100R01",{"$f":"VLOOKUP(D53,AllDocs!A:D,2,0)","v":"Guidelines_for_Mapping_ LWM2M_Objects"},{"$f":"VLOOKUP(D53,AllDocs!A:D,3,0)","v":"Convida"},{"$f":"VLOOKUP(D53,AllDocs!A:D,4,0)","v":"2017-05-23T05:29:18"},"Agreed",{"$f":"VLOOKUP(D53,AllDocs!A:F,6,0)","v":"CR"},"TS-0005 (WI-0010)",3]
["Tue-5 (17:00-18:30)",{"$f":"VLOOKUP(A54,logistics!G:I,2,0)","v":"MADRID 2"},{"$f":"VLOOKUP(A54,logistics!G:I,3,0)","v":"ARC/MAS"},"MAS-2017-0101",{"$f":"VLOOKUP(D54,AllDocs!A:D,2,0)","v":"TS-0014_Updates_for_LWM2M_Interworking_with_mgmtObjects"},{"$f":"VLOOKUP(D54,AllDocs!A:D,3,0)","v":"Convida"},{"$f":"VLOOKUP(D54,AllDocs!A:D,4,0)","v":"2017-05-12T18:52:20"},"Noted",{"$f":"VLOOKUP(D54,AllDocs!A:F,6,0)","v":"CR"},"TS-0014 (WI-0024)",3]
["Tue-5 (17:00-18:30)",{"$f":"VLOOKUP(A55,logistics!G:I,2,0)","v":"MADRID 2"},{"$f":"VLOOKUP(A55,logistics!G:I,3,0)","v":"ARC/MAS"},"MAS-2017-0101R01",{"$f":"VLOOKUP(D55,AllDocs!A:D,2,0)","v":"TS-0014_Updates_for_LWM2M_Interworking_with_mgmtObjects"},{"$f":"VLOOKUP(D55,AllDocs!A:D,3,0)","v":"Convida"},{"$f":"VLOOKUP(D55,AllDocs!A:D,4,0)","v":"2017-05-23T05:28:38"},"Agreed",{"$f":"VLOOKUP(D55,AllDocs!A:F,6,0)","v":"CR"},"TS-0014 (WI-0024)",3]
["Tue-5 (17:00-18:30)",{"$f":"VLOOKUP(A56,logistics!G:I,2,0)","v":"MADRID 2"},{"$f":"VLOOKUP(A56,logistics!G:I,3,0)","v":"ARC/MAS"},"ARC-2017-0192",{"$f":"VLOOKUP(D56,AllDocs!A:D,2,0)","v":"mgmtObj_objectID_attribute"},{"$f":"VLOOKUP(D56,AllDocs!A:D,3,0)","v":"Convida"},{"$f":"VLOOKUP(D56,AllDocs!A:D,4,0)","v":"2017-05-12T18:45:03"},"Noted",{"$f":"VLOOKUP(D56,AllDocs!A:F,6,0)","v":"CR"},"TS-0001 (WI-0002)",3]
["Tue-5 (17:00-18:30)",{"$f":"VLOOKUP(A57,logistics!G:I,2,0)","v":"MADRID 2"},{"$f":"VLOOKUP(A57,logistics!G:I,3,0)","v":"ARC/MAS"},"ARC-2017-0192R01",{"$f":"VLOOKUP(D57,AllDocs!A:D,2,0)","v":"mgmtObj_objectID_attribute"},{"$f":"VLOOKUP(D57,AllDocs!A:D,3,0)","v":"Convida"},{"$f":"VLOOKUP(D57,AllDocs!A:D,4,0)","v":"2017-05-23T05:26:54"},"Agreed",{"$f":"VLOOKUP(D57,AllDocs!A:F,6,0)","v":"CR"},"TS-0001 (WI-0002)",3]
["Tue-5 (17:00-18:30)",{"$f":"VLOOKUP(A58,logistics!G:I,2,0)","v":"MADRID 2"},{"$f":"VLOOKUP(A58,logistics!G:I,3,0)","v":"ARC/MAS"},"ARC-2017-0191",{"$f":"VLOOKUP(D58,AllDocs!A:D,2,0)","v":"Semantic Query and Semantic Content"},{"$f":"VLOOKUP(D58,AllDocs!A:D,3,0)","v":"NEC"},{"$f":"VLOOKUP(D58,AllDocs!A:D,4,0)","v":"2017-05-12T17:15:01"},"Noted",{"$f":"VLOOKUP(D58,AllDocs!A:F,6,0)","v":"INC"},"TS-0001 (WI-0002)",3,"Discussion"]
["Tue-5 (17:00-18:30)",{"$f":"VLOOKUP(A59,logistics!G:I,2,0)","v":"MADRID 2"},{"$f":"VLOOKUP(A59,logistics!G:I,3,0)","v":"ARC/MAS"},"ARC-2017-0191R01",{"$f":"VLOOKUP(D59,AllDocs!A:D,2,0)","v":"Semantic Query and Semantic Content"},{"$f":"VLOOKUP(D59,AllDocs!A:D,3,0)","v":"NEC"},{"$f":"VLOOKUP(D59,AllDocs!A:D,4,0)","v":"2017-05-23T05:07:34"},"Noted",{"$f":"VLOOKUP(D59,AllDocs!A:F,6,0)","v":"INC"},"TS-0001 (WI-0002)",3,"Discussion","1. currently, virtual resources cannot be created explicitly via APIs. Preference is to use the request parameter to indicate the semantic query.\n2. for content-based semantic query, both options could be supported. "]
["Tue-5 (17:00-18:30)",{"$f":"VLOOKUP(A60,logistics!G:I,2,0)","v":"MADRID 2"},{"$f":"VLOOKUP(A60,logistics!G:I,3,0)","v":"ARC/MAS"},"MAS-2017-0121",{"$f":"VLOOKUP(D60,AllDocs!A:D,2,0)","v":"TS-0022_corrections"},{"$f":"VLOOKUP(D60,AllDocs!A:D,3,0)","v":"Qualcomm Inc. (TIA)"},{"$f":"VLOOKUP(D60,AllDocs!A:D,4,0)","v":"2017-05-22T06:14:50"},"Noted",{"$f":"VLOOKUP(D60,AllDocs!A:F,6,0)","v":"CR"},"TS-0022 (WI-0030)","2a"]
["Thu-1 (08:30-10:00)",{"$f":"VLOOKUP(A61,logistics!G:I,2,0)","v":"MADRID 2"},{"$f":"VLOOKUP(A61,logistics!G:I,3,0)","v":"ARC/MAS"},"ARC-2017-0183",{"$f":"VLOOKUP(D61,AllDocs!A:D,2,0)","v":"Modbus_Interworking_Scenarios"},{"$f":"VLOOKUP(D61,AllDocs!A:D,3,0)","v":"ZTE"},{"$f":"VLOOKUP(D61,AllDocs!A:D,4,0)","v":"2017-05-12T09:14:01"},"Noted",{"$f":"VLOOKUP(D61,AllDocs!A:F,6,0)","v":"INC"},"TR-0043 (WI-0072)",3]
["Thu-1 (08:30-10:00)",{"$f":"VLOOKUP(A62,logistics!G:I,2,0)","v":"MADRID 2"},{"$f":"VLOOKUP(A62,logistics!G:I,3,0)","v":"ARC/MAS"},"ARC-2017-0183R01",{"$f":"VLOOKUP(D62,AllDocs!A:D,2,0)","v":"Modbus_Interworking_Scenarios"},{"$f":"VLOOKUP(D62,AllDocs!A:D,3,0)","v":"ZTE"},{"$f":"VLOOKUP(D62,AllDocs!A:D,4,0)","v":"2017-05-23T03:51:32"},"Agreed",{"$f":"VLOOKUP(D62,AllDocs!A:F,6,0)","v":"INC"},"TR-0043 (WI-0072)",3]
["Thu-1 (08:30-10:00)",{"$f":"VLOOKUP(A63,logistics!G:I,2,0)","v":"MADRID 2"},{"$f":"VLOOKUP(A63,logistics!G:I,3,0)","v":"ARC/MAS"},"ARC-2017-0197",{"$f":"VLOOKUP(D63,AllDocs!A:D,2,0)","v":"Modbus_Interworking_solutions"},{"$f":"VLOOKUP(D63,AllDocs!A:D,3,0)","v":"ZTE"},{"$f":"VLOOKUP(D63,AllDocs!A:D,4,0)","v":"2017-05-14T15:15:24"},"Noted",{"$f":"VLOOKUP(D63,AllDocs!A:F,6,0)","v":"INC"},"TR-0043 (WI-0072)",3]
["Thu-1 (08:30-10:00)",{"$f":"VLOOKUP(A64,logistics!G:I,2,0)","v":"MADRID 2"},{"$f":"VLOOKUP(A64,logistics!G:I,3,0)","v":"ARC/MAS"},"ARC-2017-0197R01",{"$f":"VLOOKUP(D64,AllDocs!A:D,2,0)","v":"Modbus_Interworking_solutions"},{"$f":"VLOOKUP(D64,AllDocs!A:D,3,0)","v":"ZTE"},{"$f":"VLOOKUP(D64,AllDocs!A:D,4,0)","v":"2017-05-23T09:31:49"},"Noted",{"$f":"VLOOKUP(D64,AllDocs!A:F,6,0)","v":"INC"},"TR-0043 (WI-0072)",3,null,"Embedded IPE should be removed for now, and put editor's note as ffs.\nresource model should be updated into separate diagrams to be clear."]
["Thu-1 (08:30-10:00)",{"$f":"VLOOKUP(A65,logistics!G:I,2,0)","v":"MADRID 2"},{"$f":"VLOOKUP(A65,logistics!G:I,3,0)","v":"ARC/MAS"},"ARC-2017-0175",{"$f":"VLOOKUP(D65,AllDocs!A:D,2,0)","v":"OPC-UA IWK Possible Impacts on oneM2M"},{"$f":"VLOOKUP(D65,AllDocs!A:D,3,0)","v":"Hitachi"},{"$f":"VLOOKUP(D65,AllDocs!A:D,4,0)","v":"2017-05-12T01:35:53"},"Noted",{"$f":"VLOOKUP(D65,AllDocs!A:F,6,0)","v":"INC"},"TR-0018 (WI-0059)",3]
["Thu-1 (08:30-10:00)",{"$f":"VLOOKUP(A66,logistics!G:I,2,0)","v":"MADRID 2"},{"$f":"VLOOKUP(A66,logistics!G:I,3,0)","v":"ARC/MAS"},"ARC-2017-0175R01",{"$f":"VLOOKUP(D66,AllDocs!A:D,2,0)","v":"OPC-UA IWK Possible Impacts on oneM2M"},{"$f":"VLOOKUP(D66,AllDocs!A:D,3,0)","v":"Hitachi"},{"$f":"VLOOKUP(D66,AllDocs!A:D,4,0)","v":"2017-05-23T02:58:21"},"Noted",{"$f":"VLOOKUP(D66,AllDocs!A:F,6,0)","v":"INC"},"TR-0018 (WI-0059)",3]
["Thu-1 (08:30-10:00)",{"$f":"VLOOKUP(A67,logistics!G:I,2,0)","v":"MADRID 2"},{"$f":"VLOOKUP(A67,logistics!G:I,3,0)","v":"ARC/MAS"},"ARC-2017-0175R02",{"$f":"VLOOKUP(D67,AllDocs!A:D,2,0)","v":{"$error":"#N/A"}},{"$f":"VLOOKUP(D67,AllDocs!A:D,3,0)","v":{"$error":"#N/A"}},{"$f":"VLOOKUP(D67,AllDocs!A:D,4,0)","v":{"$error":"#N/A"}},"Agreed",{"$f":"VLOOKUP(D67,AllDocs!A:F,6,0)","v":{"$error":"#N/A"}},"TR-0018 (WI-0059)",3]
["Thu-1 (08:30-10:00)",{"$f":"VLOOKUP(A68,logistics!G:I,2,0)","v":"MADRID 2"},{"$f":"VLOOKUP(A68,logistics!G:I,3,0)","v":"ARC/MAS"},"ARC-2017-0195R01",{"$f":"VLOOKUP(D68,AllDocs!A:D,2,0)","v":"Proximal_IoT_Interworking_solution_discussion"},{"$f":"VLOOKUP(D68,AllDocs!A:D,3,0)","v":"Huawei Technologies Co., Ltd."},{"$f":"VLOOKUP(D68,AllDocs!A:D,4,0)","v":"2017-05-24T17:21:30"},"Noted",{"$f":"VLOOKUP(D68,AllDocs!A:F,6,0)","v":"INC"},"TS-0033 (WI-0056)",3,"Discussion","in principle, should represent resource tree in the same way for oneM2M native and interworked entities. next step is to show differences "]
["Thu-1 (08:30-10:00)",{"$f":"VLOOKUP(A69,logistics!G:I,2,0)","v":"MADRID 2"},{"$f":"VLOOKUP(A69,logistics!G:I,3,0)","v":"ARC/MAS"},"MAS-2017-0117R01",{"$f":"VLOOKUP(D69,AllDocs!A:D,2,0)","v":"New type definitions for Generic Interworking"},{"$f":"VLOOKUP(D69,AllDocs!A:D,3,0)","v":"NEC"},{"$f":"VLOOKUP(D69,AllDocs!A:D,4,0)","v":"2017-05-24T16:38:59"},"Noted",{"$f":"VLOOKUP(D69,AllDocs!A:F,6,0)","v":"INC"},"TS-0030 (WI-0063)",3,null,"need offline discusison."]
["Thu-1 (08:30-10:00)",{"$f":"VLOOKUP(A70,logistics!G:I,2,0)","v":"MADRID 2"},{"$f":"VLOOKUP(A70,logistics!G:I,3,0)","v":"ARC/MAS"},"ARC-2017-0202",{"$f":"VLOOKUP(D70,AllDocs!A:D,2,0)","v":"contentInstance immutability discussion"},{"$f":"VLOOKUP(D70,AllDocs!A:D,3,0)","v":"Convida"},{"$f":"VLOOKUP(D70,AllDocs!A:D,4,0)","v":"2017-05-14T21:03:27"},"Noted",{"$f":"VLOOKUP(D70,AllDocs!A:F,6,0)","v":"AG"},"TS-0001 (WI-0002)",3,null,"in principle no major concern to change contentInstance to mutable. Further contribution to be discussed in ARC/PRO/SEC/MAS."]
["Thu-2 (10:30-12:00)",{"$f":"VLOOKUP(A71,logistics!G:I,2,0)","v":"MADRID 5 "},{"$f":"VLOOKUP(A71,logistics!G:I,3,0)","v":"MAS-adhoc"},"MAS-2017-0095",{"$f":"VLOOKUP(D71,AllDocs!A:D,2,0)","v":"Adding_omaDevice_module _to_TS-0023"},{"$f":"VLOOKUP(D71,AllDocs!A:D,3,0)","v":"NTT"},{"$f":"VLOOKUP(D71,AllDocs!A:D,4,0)","v":"2017-05-12T09:08:39"},null,{"$f":"VLOOKUP(D71,AllDocs!A:F,6,0)","v":"CR"},"TS-0023 (WI-0056)",3]
["Thu-2 (10:30-12:00)",{"$f":"VLOOKUP(A72,logistics!G:I,2,0)","v":"MADRID 5 "},{"$f":"VLOOKUP(A72,logistics!G:I,3,0)","v":"MAS-adhoc"},"MAS-2017-0095R01",{"$f":"VLOOKUP(D72,AllDocs!A:D,2,0)","v":"Adding_omaDevice_module _to_TS-0023"},{"$f":"VLOOKUP(D72,AllDocs!A:D,3,0)","v":"NTT"},{"$f":"VLOOKUP(D72,AllDocs!A:D,4,0)","v":"2017-05-22T13:35:56"},null,{"$f":"VLOOKUP(D72,AllDocs!A:F,6,0)","v":"CR"},"TS-0023 (WI-0056)",3,null,"agree to move partNum to [deviceInfo].\nR02 expected."]
["Thu-2 (10:30-12:00)",{"$f":"VLOOKUP(A73,logistics!G:I,2,0)","v":"MADRID 5 "},{"$f":"VLOOKUP(A73,logistics!G:I,3,0)","v":"MAS-adhoc"},"MAS-2017-0113",{"$f":"VLOOKUP(D73,AllDocs!A:D,2,0)","v":"HAIM modification for cooktop model"},{"$f":"VLOOKUP(D73,AllDocs!A:D,3,0)","v":"QUALCOMM Inc. (TIA)"},{"$f":"VLOOKUP(D73,AllDocs!A:D,4,0)","v":"2017-05-23T04:03:41"},null,{"$f":"VLOOKUP(D73,AllDocs!A:F,6,0)","v":"CR"},"TS-0023 (WI-0056)",3,null,"R01 expected. A separate CR is needed to add design rule for multiple instances of Module Class."]
["Thu-2 (10:30-12:00)",{"$f":"VLOOKUP(A74,logistics!G:I,2,0)","v":"MADRID 5 "},{"$f":"VLOOKUP(A74,logistics!G:I,3,0)","v":"MAS-adhoc"},"MAS-2017-0110",{"$f":"VLOOKUP(D74,AllDocs!A:D,2,0)","v":"HAIM modification for receiver model"},{"$f":"VLOOKUP(D74,AllDocs!A:D,3,0)","v":"QUALCOMM Inc. (TIA)"},{"$f":"VLOOKUP(D74,AllDocs!A:D,4,0)","v":"2017-05-22T09:28:18"},null,{"$f":"VLOOKUP(D74,AllDocs!A:F,6,0)","v":"CR"},"TS-0023 (WI-0056)",3]
["Thu-2 (10:30-12:00)",{"$f":"VLOOKUP(A75,logistics!G:I,2,0)","v":"MADRID 5 "},{"$f":"VLOOKUP(A75,logistics!G:I,3,0)","v":"MAS-adhoc"},"MAS-2017-0110R01",{"$f":"VLOOKUP(D75,AllDocs!A:D,2,0)","v":"HAIM modification for receiver model"},{"$f":"VLOOKUP(D75,AllDocs!A:D,3,0)","v":"QUALCOMM Inc. (TIA)"},{"$f":"VLOOKUP(D75,AllDocs!A:D,4,0)","v":"2017-05-23T03:21:20"},null,{"$f":"VLOOKUP(D75,AllDocs!A:F,6,0)","v":"CR"},"TS-0023 (WI-0056)",3]
["Thu-2 (10:30-12:00)",{"$f":"VLOOKUP(A76,logistics!G:I,2,0)","v":"MADRID 5 "},{"$f":"VLOOKUP(A76,logistics!G:I,3,0)","v":"MAS-adhoc"},"MAS-2017-0110R02",{"$f":"VLOOKUP(D76,AllDocs!A:D,2,0)","v":"HAIM modification for receiver model"},{"$f":"VLOOKUP(D76,AllDocs!A:D,3,0)","v":"QUALCOMM Inc. (TIA)"},{"$f":"VLOOKUP(D76,AllDocs!A:D,4,0)","v":"2017-05-25T02:55:45"},null,{"$f":"VLOOKUP(D76,AllDocs!A:F,6,0)","v":"CR"},"TS-0023 (WI-0056)",3]
["Thu-2 (10:30-12:00)",{"$f":"VLOOKUP(A77,logistics!G:I,2,0)","v":"MADRID 5 "},{"$f":"VLOOKUP(A77,logistics!G:I,3,0)","v":"MAS-adhoc"},"MAS-2017-0115R02",{"$f":"VLOOKUP(D77,AllDocs!A:D,2,0)","v":"HAIM modification for set top box model"},{"$f":"VLOOKUP(D77,AllDocs!A:D,3,0)","v":"QUALCOMM Inc. (TIA)"},{"$f":"VLOOKUP(D77,AllDocs!A:D,4,0)","v":"2017-05-25T02:46:19"},null,{"$f":"VLOOKUP(D77,AllDocs!A:F,6,0)","v":"CR"},"TS-0023 (WI-0056)",3]
["Thu-2 (10:30-12:00)",{"$f":"VLOOKUP(A78,logistics!G:I,2,0)","v":"MADRID 5 "},{"$f":"VLOOKUP(A78,logistics!G:I,3,0)","v":"MAS-adhoc"},"MAS-2017-0109R02",{"$f":"VLOOKUP(D78,AllDocs!A:D,2,0)","v":"HAIM_modification_for_TV_model"},{"$f":"VLOOKUP(D78,AllDocs!A:D,3,0)","v":"LG Electronics"},{"$f":"VLOOKUP(D78,AllDocs!A:D,4,0)","v":"2017-05-25T03:02:43"},null,{"$f":"VLOOKUP(D78,AllDocs!A:F,6,0)","v":"CR"},"TS-0023 (WI-0056)",3]
["Thu-2 (10:30-12:00)",{"$f":"VLOOKUP(A79,logistics!G:I,2,0)","v":"MADRID 5 "},{"$f":"VLOOKUP(A79,logistics!G:I,3,0)","v":"MAS-adhoc"},"MAS-2017-0088R02",{"$f":"VLOOKUP(D79,AllDocs!A:D,2,0)","v":"Adding a new ModuleClass for retrieving and setting movement information"},{"$f":"VLOOKUP(D79,AllDocs!A:D,3,0)","v":"Andreas Kraft (Deutsche Telekom)"},{"$f":"VLOOKUP(D79,AllDocs!A:D,4,0)","v":"2017-05-23T09:31:23"},null,{"$f":"VLOOKUP(D79,AllDocs!A:F,6,0)","v":"CR"},"TS-0023 (WI-0056)",3,null,"R03 expected"]
["Thu-2 (10:30-12:00)",{"$f":"VLOOKUP(A80,logistics!G:I,2,0)","v":"MADRID 5 "},{"$f":"VLOOKUP(A80,logistics!G:I,3,0)","v":"MAS-adhoc"},"MAS-2017-0123R01",{"$f":"VLOOKUP(D80,AllDocs!A:D,2,0)","v":"Discussion on updating multiple data points in ModuleClasses"},{"$f":"VLOOKUP(D80,AllDocs!A:D,3,0)","v":"Andreas Kraft (Deutsche Telekom), Orange"},{"$f":"VLOOKUP(D80,AllDocs!A:D,4,0)","v":"2017-05-23T05:59:31"},null,{"$f":"VLOOKUP(D80,AllDocs!A:F,6,0)","v":"AG"},null,null,null,"still the problem needs to be better understood."]
["Thu-3 (13:30-15:00)",{"$f":"VLOOKUP(A81,logistics!G:I,2,0)","v":"MADRID 3"},{"$f":"VLOOKUP(A81,logistics!G:I,3,0)","v":"MAS"},"MAS-2017-0096",{"$f":"VLOOKUP(D81,AllDocs!A:D,2,0)","v":"Semantic Mashup for TS-0034"},{"$f":"VLOOKUP(D81,AllDocs!A:D,3,0)","v":"Convida"},{"$f":"VLOOKUP(D81,AllDocs!A:D,4,0)","v":"2017-05-12T13:36:37"},"Noted",{"$f":"VLOOKUP(D81,AllDocs!A:F,6,0)","v":"CR"},"TS-0034 (WI-0053)",3]
["Thu-3 (13:30-15:00)",{"$f":"VLOOKUP(A82,logistics!G:I,2,0)","v":"MADRID 3"},{"$f":"VLOOKUP(A82,logistics!G:I,3,0)","v":"MAS"},"MAS-2017-0096R01",{"$f":"VLOOKUP(D82,AllDocs!A:D,2,0)","v":"Semantic Mashup for TS-0034"},{"$f":"VLOOKUP(D82,AllDocs!A:D,3,0)","v":"Convida"},{"$f":"VLOOKUP(D82,AllDocs!A:D,4,0)","v":"2017-05-25T06:45:12"},"Agreed",{"$f":"VLOOKUP(D82,AllDocs!A:F,6,0)","v":"CR"},"TS-0034 (WI-0053)",3]
["Thu-3 (13:30-15:00)",{"$f":"VLOOKUP(A83,logistics!G:I,2,0)","v":"MADRID 3"},{"$f":"VLOOKUP(A83,logistics!G:I,3,0)","v":"MAS"},"MAS-2017-0121R02",{"$f":"VLOOKUP(D83,AllDocs!A:D,2,0)","v":"TS-0022_corrections"},{"$f":"VLOOKUP(D83,AllDocs!A:D,3,0)","v":"Qualcomm Inc. (TIA)"},{"$f":"VLOOKUP(D83,AllDocs!A:D,4,0)","v":"2017-05-24T16:03:23"},"Noted",{"$f":"VLOOKUP(D83,AllDocs!A:F,6,0)","v":"CR"},"TS-0022 (WI-0030)","2a"]
["Thu-3 (13:30-15:00)",{"$f":"VLOOKUP(A84,logistics!G:I,2,0)","v":"MADRID 3"},{"$f":"VLOOKUP(A84,logistics!G:I,3,0)","v":"MAS"},"MAS-2017-0121R03",{"$f":"VLOOKUP(D84,AllDocs!A:D,2,0)","v":"TS-0022_corrections"},{"$f":"VLOOKUP(D84,AllDocs!A:D,3,0)","v":"Qualcomm Inc. (TIA)"},{"$f":"VLOOKUP(D84,AllDocs!A:D,4,0)","v":"2017-05-25T05:43:59"},"Noted",{"$f":"VLOOKUP(D84,AllDocs!A:F,6,0)","v":"CR"},"TS-0022 (WI-0030)","2a"]
["Thu-3 (13:30-15:00)",{"$f":"VLOOKUP(A85,logistics!G:I,2,0)","v":"MADRID 3"},{"$f":"VLOOKUP(A85,logistics!G:I,3,0)","v":"MAS"},"MAS-2017-0121R04",{"$f":"VLOOKUP(D85,AllDocs!A:D,2,0)","v":"TS-0022_corrections"},{"$f":"VLOOKUP(D85,AllDocs!A:D,3,0)","v":"Qualcomm Inc. (TIA)"},{"$f":"VLOOKUP(D85,AllDocs!A:D,4,0)","v":"2017-05-25T06:04:58"},"Agreed",{"$f":"VLOOKUP(D85,AllDocs!A:F,6,0)","v":"CR"},"TS-0022 (WI-0030)","2a"]
["Thu-3 (13:30-15:00)",{"$f":"VLOOKUP(A86,logistics!G:I,2,0)","v":"MADRID 3"},{"$f":"VLOOKUP(A86,logistics!G:I,3,0)","v":"MAS"},"MAS-2017-0094R01",{"$f":"VLOOKUP(D86,AllDocs!A:D,2,0)","v":"WoT Interworking Background for TR-0042"},{"$f":"VLOOKUP(D86,AllDocs!A:D,3,0)","v":"Convida, Huawei"},{"$f":"VLOOKUP(D86,AllDocs!A:D,4,0)","v":"2017-05-24T11:29:02"},"Noted",{"$f":"VLOOKUP(D86,AllDocs!A:F,6,0)","v":"CR"},"TR-0042 (WI-0071)",3]
["Thu-3 (13:30-15:00)",{"$f":"VLOOKUP(A87,logistics!G:I,2,0)","v":"MADRID 3"},{"$f":"VLOOKUP(A87,logistics!G:I,3,0)","v":"MAS"},"MAS-2017-0094R02",{"$f":"VLOOKUP(D87,AllDocs!A:D,2,0)","v":"WoT Interworking Background for TR-0042"},{"$f":"VLOOKUP(D87,AllDocs!A:D,3,0)","v":"Convida, Huawei"},{"$f":"VLOOKUP(D87,AllDocs!A:D,4,0)","v":"2017-05-25T06:02:56"},"Agreed",{"$f":"VLOOKUP(D87,AllDocs!A:F,6,0)","v":"CR"},"TR-0042 (WI-0071)",3]
["Thu-3 (13:30-15:00)",{"$f":"VLOOKUP(A88,logistics!G:I,2,0)","v":"MADRID 3"},{"$f":"VLOOKUP(A88,logistics!G:I,3,0)","v":"MAS"},"MAS-2017-0118R04",{"$f":"VLOOKUP(D88,AllDocs!A:D,2,0)","v":"LwM2M_Event_Log_Mapping"},{"$f":"VLOOKUP(D88,AllDocs!A:D,3,0)","v":"Huawei Technologies Co., Ltd."},{"$f":"VLOOKUP(D88,AllDocs!A:D,4,0)","v":"2017-05-24T10:16:37"},"Agreed",{"$f":"VLOOKUP(D88,AllDocs!A:F,6,0)","v":"CR"},"TS-0005 (WI-0010)",3]
["Thu-3 (13:30-15:00)",{"$f":"VLOOKUP(A89,logistics!G:I,2,0)","v":"MADRID 3"},{"$f":"VLOOKUP(A89,logistics!G:I,3,0)","v":"MAS"},"TP-2017-0110R02",{"$f":"VLOOKUP(D89,AllDocs!A:D,2,0)","v":"LS_to_OMA-DM_on_EventLog_LwM2M_Objects"},{"$f":"VLOOKUP(D89,AllDocs!A:D,3,0)","v":"Huawei Technologies Co., Ltd."},{"$f":"VLOOKUP(D89,AllDocs!A:D,4,0)","v":"2017-05-24T05:49:53"},"Noted",{"$f":"VLOOKUP(D89,AllDocs!A:F,6,0)","v":"LS"},null,null,null,"Suggest to send CR only to OMA rathter than waiting for the new TS-0005 baseline.\nR03 will be submitted to TP."]
["Thu-3 (13:30-15:00)",{"$f":"VLOOKUP(A90,logistics!G:I,2,0)","v":"MADRID 3"},{"$f":"VLOOKUP(A90,logistics!G:I,3,0)","v":"MAS"},"MAS-2017-0106",{"$f":"VLOOKUP(D90,AllDocs!A:D,2,0)","v":"HAIM_modification_for_freezer_model"},{"$f":"VLOOKUP(D90,AllDocs!A:D,3,0)","v":"LG Electronics"},{"$f":"VLOOKUP(D90,AllDocs!A:D,4,0)","v":"2017-05-15T07:03:16"},"Agreed",{"$f":"VLOOKUP(D90,AllDocs!A:F,6,0)","v":"CR"},"TS-0023 (WI-0056)",3,null,"AI: Dongjoo & Andreas: considering a general rule of whether to create a 'similar' device model with different name vs merger with existing device with optional moducle classes."]
["Thu-3 (13:30-15:00)",{"$f":"VLOOKUP(A91,logistics!G:I,2,0)","v":"MADRID 3"},{"$f":"VLOOKUP(A91,logistics!G:I,3,0)","v":"MAS"},"MAS-2017-0109R02",{"$f":"VLOOKUP(D91,AllDocs!A:D,2,0)","v":"HAIM_modification_for_TV_model"},{"$f":"VLOOKUP(D91,AllDocs!A:D,3,0)","v":"LG Electronics"},{"$f":"VLOOKUP(D91,AllDocs!A:D,4,0)","v":"2017-05-25T03:02:43"},"Noted",{"$f":"VLOOKUP(D91,AllDocs!A:F,6,0)","v":"CR"},"TS-0023 (WI-0056)",3]
["Thu-3 (13:30-15:00)",{"$f":"VLOOKUP(A92,logistics!G:I,2,0)","v":"MADRID 3"},{"$f":"VLOOKUP(A92,logistics!G:I,3,0)","v":"MAS"},"MAS-2017-0109R03",{"$f":"VLOOKUP(D92,AllDocs!A:D,2,0)","v":"HAIM_modification_for_TV_model"},{"$f":"VLOOKUP(D92,AllDocs!A:D,3,0)","v":"LG Electronics"},{"$f":"VLOOKUP(D92,AllDocs!A:D,4,0)","v":"2017-05-25T03:41:21"},"Agreed",{"$f":"VLOOKUP(D92,AllDocs!A:F,6,0)","v":"CR"},"TS-0023 (WI-0056)",3]
["Thu-3 (13:30-15:00)",{"$f":"VLOOKUP(A93,logistics!G:I,2,0)","v":"MADRID 3"},{"$f":"VLOOKUP(A93,logistics!G:I,3,0)","v":"MAS"},"MAS-2017-0095",{"$f":"VLOOKUP(D93,AllDocs!A:D,2,0)","v":"Adding_omaDevice_module _to_TS-0023"},{"$f":"VLOOKUP(D93,AllDocs!A:D,3,0)","v":"NTT"},{"$f":"VLOOKUP(D93,AllDocs!A:D,4,0)","v":"2017-05-12T09:08:39"},"Noted",{"$f":"VLOOKUP(D93,AllDocs!A:F,6,0)","v":"CR"},"TS-0023 (WI-0056)",3]
["Thu-3 (13:30-15:00)",{"$f":"VLOOKUP(A94,logistics!G:I,2,0)","v":"MADRID 3"},{"$f":"VLOOKUP(A94,logistics!G:I,3,0)","v":"MAS"},"MAS-2017-0095R01",{"$f":"VLOOKUP(D94,AllDocs!A:D,2,0)","v":"Adding_omaDevice_module _to_TS-0023"},{"$f":"VLOOKUP(D94,AllDocs!A:D,3,0)","v":"NTT"},{"$f":"VLOOKUP(D94,AllDocs!A:D,4,0)","v":"2017-05-22T13:35:56"},"Noted",{"$f":"VLOOKUP(D94,AllDocs!A:F,6,0)","v":"CR"},"TS-0023 (WI-0056)",3]
["Thu-3 (13:30-15:00)",{"$f":"VLOOKUP(A95,logistics!G:I,2,0)","v":"MADRID 3"},{"$f":"VLOOKUP(A95,logistics!G:I,3,0)","v":"MAS"},"MAS-2017-0095R02",{"$f":"VLOOKUP(D95,AllDocs!A:D,2,0)","v":"Adding_omaDevice_module _to_TS-0023"},{"$f":"VLOOKUP(D95,AllDocs!A:D,3,0)","v":"NTT"},{"$f":"VLOOKUP(D95,AllDocs!A:D,4,0)","v":"2017-05-25T05:31:01"},"Noted",{"$f":"VLOOKUP(D95,AllDocs!A:F,6,0)","v":"CR"},"TS-0023 (WI-0056)",3,null,"modeling of partNumber as device or subdevice property  still need clarification"]
["Thu-3 (13:30-15:00)",{"$f":"VLOOKUP(A96,logistics!G:I,2,0)","v":"MADRID 3"},{"$f":"VLOOKUP(A96,logistics!G:I,3,0)","v":"MAS"},"MAS-2017-0113",{"$f":"VLOOKUP(D96,AllDocs!A:D,2,0)","v":"HAIM modification for cooktop model"},{"$f":"VLOOKUP(D96,AllDocs!A:D,3,0)","v":"QUALCOMM Inc. (TIA)"},{"$f":"VLOOKUP(D96,AllDocs!A:D,4,0)","v":"2017-05-23T04:03:41"},"Noted",{"$f":"VLOOKUP(D96,AllDocs!A:F,6,0)","v":"CR"},"TS-0023 (WI-0056)",3]
["Thu-3 (13:30-15:00)",{"$f":"VLOOKUP(A97,logistics!G:I,2,0)","v":"MADRID 3"},{"$f":"VLOOKUP(A97,logistics!G:I,3,0)","v":"MAS"},"MAS-2017-0113R01",{"$f":"VLOOKUP(D97,AllDocs!A:D,2,0)","v":"HAIM modification for cooktop model"},{"$f":"VLOOKUP(D97,AllDocs!A:D,3,0)","v":"QUALCOMM Inc. (TIA)"},{"$f":"VLOOKUP(D97,AllDocs!A:D,4,0)","v":"2017-05-25T06:11:04"},"Agreed",{"$f":"VLOOKUP(D97,AllDocs!A:F,6,0)","v":"CR"},"TS-0023 (WI-0056)",3]
["Thu-3 (13:30-15:00)",{"$f":"VLOOKUP(A98,logistics!G:I,2,0)","v":"MADRID 3"},{"$f":"VLOOKUP(A98,logistics!G:I,3,0)","v":"MAS"},"MAS-2017-0112",{"$f":"VLOOKUP(D98,AllDocs!A:D,2,0)","v":"HAIM modification for cookerHood model"},{"$f":"VLOOKUP(D98,AllDocs!A:D,3,0)","v":"QUALCOMM Inc. (TIA)"},{"$f":"VLOOKUP(D98,AllDocs!A:D,4,0)","v":"00:00:00"},"Postponed",{"$f":"VLOOKUP(D98,AllDocs!A:F,6,0)","v":"CR"},"TS-0023 (WI-0056)",3,null,"POSTPONED to conf-call"]
["Thu-3 (13:30-15:00)",{"$f":"VLOOKUP(A99,logistics!G:I,2,0)","v":"MADRID 3"},{"$f":"VLOOKUP(A99,logistics!G:I,3,0)","v":"MAS"},"MAS-2017-0110",{"$f":"VLOOKUP(D99,AllDocs!A:D,2,0)","v":"HAIM modification for receiver model"},{"$f":"VLOOKUP(D99,AllDocs!A:D,3,0)","v":"QUALCOMM Inc. (TIA)"},{"$f":"VLOOKUP(D99,AllDocs!A:D,4,0)","v":"2017-05-22T09:28:18"},"Noted",{"$f":"VLOOKUP(D99,AllDocs!A:F,6,0)","v":"CR"},"TS-0023 (WI-0056)",3]
["Thu-3 (13:30-15:00)",{"$f":"VLOOKUP(A100,logistics!G:I,2,0)","v":"MADRID 3"},{"$f":"VLOOKUP(A100,logistics!G:I,3,0)","v":"MAS"},"MAS-2017-0110R01",{"$f":"VLOOKUP(D100,AllDocs!A:D,2,0)","v":"HAIM modification for receiver model"},{"$f":"VLOOKUP(D100,AllDocs!A:D,3,0)","v":"QUALCOMM Inc. (TIA)"},{"$f":"VLOOKUP(D100,AllDocs!A:D,4,0)","v":"2017-05-23T03:21:20"},"Noted",{"$f":"VLOOKUP(D100,AllDocs!A:F,6,0)","v":"CR"},"TS-0023 (WI-0056)",3]
["Thu-3 (13:30-15:00)",{"$f":"VLOOKUP(A101,logistics!G:I,2,0)","v":"MADRID 3"},{"$f":"VLOOKUP(A101,logistics!G:I,3,0)","v":"MAS"},"MAS-2017-0110R02",{"$f":"VLOOKUP(D101,AllDocs!A:D,2,0)","v":"HAIM modification for receiver model"},{"$f":"VLOOKUP(D101,AllDocs!A:D,3,0)","v":"QUALCOMM Inc. (TIA)"},{"$f":"VLOOKUP(D101,AllDocs!A:D,4,0)","v":"2017-05-25T02:55:45"},"Noted",{"$f":"VLOOKUP(D101,AllDocs!A:F,6,0)","v":"CR"},"TS-0023 (WI-0056)",3]
["Thu-3 (13:30-15:00)",{"$f":"VLOOKUP(A102,logistics!G:I,2,0)","v":"MADRID 3"},{"$f":"VLOOKUP(A102,logistics!G:I,3,0)","v":"MAS"},"MAS-2017-0110R03",{"$f":"VLOOKUP(D102,AllDocs!A:D,2,0)","v":"HAIM modification for receiver model"},{"$f":"VLOOKUP(D102,AllDocs!A:D,3,0)","v":"QUALCOMM Inc. (TIA)"},{"$f":"VLOOKUP(D102,AllDocs!A:D,4,0)","v":"2017-05-25T06:22:34"},"Agreed",{"$f":"VLOOKUP(D102,AllDocs!A:F,6,0)","v":"CR"},"TS-0023 (WI-0056)",3]
["Thu-3 (13:30-15:00)",{"$f":"VLOOKUP(A103,logistics!G:I,2,0)","v":"MADRID 3"},{"$f":"VLOOKUP(A103,logistics!G:I,3,0)","v":"MAS"},"MAS-2017-0105",{"$f":"VLOOKUP(D103,AllDocs!A:D,2,0)","v":"HAIM modification for camera model"},{"$f":"VLOOKUP(D103,AllDocs!A:D,3,0)","v":"QUALCOMM Inc. (TIA)"},{"$f":"VLOOKUP(D103,AllDocs!A:D,4,0)","v":"00:00:00"},"Postponed",{"$f":"VLOOKUP(D103,AllDocs!A:F,6,0)","v":"CR"},"TS-0023 (WI-0056)",3,null,"POSTPONED to conf-call"]
["Thu-3 (13:30-15:00)",{"$f":"VLOOKUP(A104,logistics!G:I,2,0)","v":"MADRID 3"},{"$f":"VLOOKUP(A104,logistics!G:I,3,0)","v":"MAS"},"MAS-2017-0115R02",{"$f":"VLOOKUP(D104,AllDocs!A:D,2,0)","v":"HAIM modification for set top box model"},{"$f":"VLOOKUP(D104,AllDocs!A:D,3,0)","v":"QUALCOMM Inc. (TIA)"},{"$f":"VLOOKUP(D104,AllDocs!A:D,4,0)","v":"2017-05-25T02:46:19"},"Agreed",{"$f":"VLOOKUP(D104,AllDocs!A:F,6,0)","v":"CR"},"TS-0023 (WI-0056)",3]
["Thu-3 (13:30-15:00)",{"$f":"VLOOKUP(A105,logistics!G:I,2,0)","v":"MADRID 3"},{"$f":"VLOOKUP(A105,logistics!G:I,3,0)","v":"MAS"},"MAS-2017-0088R02",{"$f":"VLOOKUP(D105,AllDocs!A:D,2,0)","v":"Adding a new ModuleClass for retrieving and setting movement information"},{"$f":"VLOOKUP(D105,AllDocs!A:D,3,0)","v":"Andreas Kraft (Deutsche Telekom)"},{"$f":"VLOOKUP(D105,AllDocs!A:D,4,0)","v":"2017-05-23T09:31:23"},"Noted",{"$f":"VLOOKUP(D105,AllDocs!A:F,6,0)","v":"CR"},"TS-0023 (WI-0056)",3]
["Thu-3 (13:30-15:00)",{"$f":"VLOOKUP(A106,logistics!G:I,2,0)","v":"MADRID 3"},{"$f":"VLOOKUP(A106,logistics!G:I,3,0)","v":"MAS"},"MAS-2017-0088R03",{"$f":"VLOOKUP(D106,AllDocs!A:D,2,0)","v":"Adding a new ModuleClass for retrieving and setting movement information"},{"$f":"VLOOKUP(D106,AllDocs!A:D,3,0)","v":"Andreas Kraft (Deutsche Telekom)"},{"$f":"VLOOKUP(D106,AllDocs!A:D,4,0)","v":"2017-05-25T05:38:14"},"Noted",{"$f":"VLOOKUP(D106,AllDocs!A:F,6,0)","v":"CR"},"TS-0023 (WI-0056)",3]
["Thu-3 (13:30-15:00)",{"$f":"VLOOKUP(A107,logistics!G:I,2,0)","v":"MADRID 3"},{"$f":"VLOOKUP(A107,logistics!G:I,3,0)","v":"MAS"},"MAS-2017-0123R01",{"$f":"VLOOKUP(D107,AllDocs!A:D,2,0)","v":"Discussion on updating multiple data points in ModuleClasses"},{"$f":"VLOOKUP(D107,AllDocs!A:D,3,0)","v":"Andreas Kraft (Deutsche Telekom), Orange"},{"$f":"VLOOKUP(D107,AllDocs!A:D,4,0)","v":"2017-05-23T05:59:31"},"Noted",{"$f":"VLOOKUP(D107,AllDocs!A:F,6,0)","v":"AG"},null,null,null,"Further discussion in conf-call"]
["Thu-3 (13:30-15:00)",{"$f":"VLOOKUP(A108,logistics!G:I,2,0)","v":"MADRID 3"},{"$f":"VLOOKUP(A108,logistics!G:I,3,0)","v":"MAS"},"MAS-2017-0124",{"$f":"VLOOKUP(D108,AllDocs!A:D,2,0)","v":"TR-0046 DASE case study"},{"$f":"VLOOKUP(D108,AllDocs!A:D,3,0)","v":"SyncTechno, KETI"},{"$f":"VLOOKUP(D108,AllDocs!A:D,4,0)","v":"2017-05-24T02:34:11"},"Noted",{"$f":"VLOOKUP(D108,AllDocs!A:F,6,0)","v":"INC"},"TR-0046 (WI-0070)",3]
["Thu-3 (13:30-15:00)",{"$f":"VLOOKUP(A109,logistics!G:I,2,0)","v":"MADRID 3"},{"$f":"VLOOKUP(A109,logistics!G:I,3,0)","v":"MAS"},"MAS-2017-0124R01",{"$f":"VLOOKUP(D109,AllDocs!A:D,2,0)","v":"TR-0046 DASE case study"},{"$f":"VLOOKUP(D109,AllDocs!A:D,3,0)","v":"SyncTechno, KETI"},{"$f":"VLOOKUP(D109,AllDocs!A:D,4,0)","v":"2017-05-25T06:57:59"},"Agreed",{"$f":"VLOOKUP(D109,AllDocs!A:F,6,0)","v":"INC"},"TR-0046 (WI-0070)",3]
["Thu-3 (13:30-15:00)",{"$f":"VLOOKUP(A110,logistics!G:I,2,0)","v":"MADRID 3"},{"$f":"VLOOKUP(A110,logistics!G:I,3,0)","v":"MAS"},"<W3C SSN review>",{"$f":"VLOOKUP(D110,AllDocs!A:D,2,0)","v":{"$error":"#N/A"}},{"$f":"VLOOKUP(D110,AllDocs!A:D,3,0)","v":{"$error":"#N/A"}},{"$f":"VLOOKUP(D110,AllDocs!A:D,4,0)","v":{"$error":"#N/A"}},"Noted",{"$f":"VLOOKUP(D110,AllDocs!A:F,6,0)","v":{"$error":"#N/A"}},null,null,"Discussion","Individuals are invited to see the W3C email posted on MAS list, and provide any comments directly to W3C."]
["Thu-3 (13:30-15:00)",{"$f":"VLOOKUP(A111,logistics!G:I,2,0)","v":"MADRID 3"},{"$f":"VLOOKUP(A111,logistics!G:I,3,0)","v":"MAS"},"TP-2017-0116",{"$f":"VLOOKUP(D111,AllDocs!A:D,2,0)","v":"IETF Workshop on IoT Semantic/Hypermedia Interoperability"},{"$f":"VLOOKUP(D111,AllDocs!A:D,3,0)","v":"Timothy Carey, Nokia"},{"$f":"VLOOKUP(D111,AllDocs!A:D,4,0)","v":"2017-05-20T04:02:52"},"Noted",{"$f":"VLOOKUP(D111,AllDocs!A:F,6,0)","v":"INC"},null,null,"Discussion","Agree to have a \"state of the union\" talk for oneM2M.\nAI: Tim attend the workshop and present, NEC/Convida provide input on semantics, LGE/DT provide input on SDT/Abstraction."]
["Thu-3 (13:30-15:00)",{"$f":"VLOOKUP(A112,logistics!G:I,2,0)","v":"MADRID 3"},{"$f":"VLOOKUP(A112,logistics!G:I,3,0)","v":"MAS"},"<ITU-T transposing, select list of TS/TR>",{"$f":"VLOOKUP(D112,AllDocs!A:D,2,0)","v":{"$error":"#N/A"}},{"$f":"VLOOKUP(D112,AllDocs!A:D,3,0)","v":{"$error":"#N/A"}},{"$f":"VLOOKUP(D112,AllDocs!A:D,4,0)","v":{"$error":"#N/A"}},"Noted",{"$f":"VLOOKUP(D112,AllDocs!A:F,6,0)","v":{"$error":"#N/A"}},null,null,"Discussion","list of deliverables to be transposed:\nTS-0005, TS-0006, TS-0012, TS-0022, TS-0023."]
[null,{"$f":"VLOOKUP(A113,logistics!G:I,2,0)","v":{"$error":"#N/A"}},{"$f":"VLOOKUP(A113,logistics!G:I,3,0)","v":{"$error":"#N/A"}},null,{"$f":"VLOOKUP(D113,AllDocs!A:D,2,0)","v":{"$error":"#N/A"}},{"$f":"VLOOKUP(D113,AllDocs!A:D,3,0)","v":{"$error":"#N/A"}},{"$f":"VLOOKUP(D113,AllDocs!A:D,4,0)","v":{"$error":"#N/A"}},null,{"$f":"VLOOKUP(D113,AllDocs!A:F,6,0)","v":{"$error":"#N/A"}}]
[null,{"$f":"VLOOKUP(A114,logistics!G:I,2,0)","v":{"$error":"#N/A"}},{"$f":"VLOOKUP(A114,logistics!G:I,3,0)","v":{"$error":"#N/A"}},null,{"$f":"VLOOKUP(D114,AllDocs!A:D,2,0)","v":{"$error":"#N/A"}},{"$f":"VLOOKUP(D114,AllDocs!A:D,3,0)","v":{"$error":"#N/A"}},{"$f":"VLOOKUP(D114,AllDocs!A:D,4,0)","v":{"$error":"#N/A"}},null,{"$f":"VLOOKUP(D114,AllDocs!A:F,6,0)","v":{"$error":"#N/A"}}]
[null,{"$f":"VLOOKUP(A115,logistics!G:I,2,0)","v":{"$error":"#N/A"}},{"$f":"VLOOKUP(A115,logistics!G:I,3,0)","v":{"$error":"#N/A"}},null,{"$f":"VLOOKUP(D115,AllDocs!A:D,2,0)","v":{"$error":"#N/A"}},{"$f":"VLOOKUP(D115,AllDocs!A:D,3,0)","v":{"$error":"#N/A"}},{"$f":"VLOOKUP(D115,AllDocs!A:D,4,0)","v":{"$error":"#N/A"}},null,{"$f":"VLOOKUP(D115,AllDocs!A:F,6,0)","v":{"$error":"#N/A"}}]
[null,{"$f":"VLOOKUP(A116,logistics!G:I,2,0)","v":{"$error":"#N/A"}},{"$f":"VLOOKUP(A116,logistics!G:I,3,0)","v":{"$error":"#N/A"}},null,{"$f":"VLOOKUP(D116,AllDocs!A:D,2,0)","v":{"$error":"#N/A"}},{"$f":"VLOOKUP(D116,AllDocs!A:D,3,0)","v":{"$error":"#N/A"}},{"$f":"VLOOKUP(D116,AllDocs!A:D,4,0)","v":{"$error":"#N/A"}},null,{"$f":"VLOOKUP(D116,AllDocs!A:F,6,0)","v":{"$error":"#N/A"}}]
[null,{"$f":"VLOOKUP(A117,logistics!G:I,2,0)","v":{"$error":"#N/A"}},{"$f":"VLOOKUP(A117,logistics!G:I,3,0)","v":{"$error":"#N/A"}},null,{"$f":"VLOOKUP(D117,AllDocs!A:D,2,0)","v":{"$error":"#N/A"}},{"$f":"VLOOKUP(D117,AllDocs!A:D,3,0)","v":{"$error":"#N/A"}},{"$f":"VLOOKUP(D117,AllDocs!A:D,4,0)","v":{"$error":"#N/A"}},null,{"$f":"VLOOKUP(D117,AllDocs!A:F,6,0)","v":{"$error":"#N/A"}}]
[null,{"$f":"VLOOKUP(A118,logistics!G:I,2,0)","v":{"$error":"#N/A"}},{"$f":"VLOOKUP(A118,logistics!G:I,3,0)","v":{"$error":"#N/A"}},null,{"$f":"VLOOKUP(D118,AllDocs!A:D,2,0)","v":{"$error":"#N/A"}},{"$f":"VLOOKUP(D118,AllDocs!A:D,3,0)","v":{"$error":"#N/A"}},{"$f":"VLOOKUP(D118,AllDocs!A:D,4,0)","v":{"$error":"#N/A"}},null,{"$f":"VLOOKUP(D118,AllDocs!A:F,6,0)","v":{"$error":"#N/A"}}]
[null,{"$f":"VLOOKUP(A119,logistics!G:I,2,0)","v":{"$error":"#N/A"}},{"$f":"VLOOKUP(A119,logistics!G:I,3,0)","v":{"$error":"#N/A"}},null,{"$f":"VLOOKUP(D119,AllDocs!A:D,2,0)","v":{"$error":"#N/A"}},{"$f":"VLOOKUP(D119,AllDocs!A:D,3,0)","v":{"$error":"#N/A"}},{"$f":"VLOOKUP(D119,AllDocs!A:D,4,0)","v":{"$error":"#N/A"}},null,{"$f":"VLOOKUP(D119,AllDocs!A:F,6,0)","v":{"$error":"#N/A"}}]
[null,{"$f":"VLOOKUP(A120,logistics!G:I,2,0)","v":{"$error":"#N/A"}},{"$f":"VLOOKUP(A120,logistics!G:I,3,0)","v":{"$error":"#N/A"}},null,{"$f":"VLOOKUP(D120,AllDocs!A:D,2,0)","v":{"$error":"#N/A"}},{"$f":"VLOOKUP(D120,AllDocs!A:D,3,0)","v":{"$error":"#N/A"}},{"$f":"VLOOKUP(D120,AllDocs!A:D,4,0)","v":{"$error":"#N/A"}},null,{"$f":"VLOOKUP(D120,AllDocs!A:F,6,0)","v":{"$error":"#N/A"}}]
[null,{"$f":"VLOOKUP(A121,logistics!G:I,2,0)","v":{"$error":"#N/A"}},{"$f":"VLOOKUP(A121,logistics!G:I,3,0)","v":{"$error":"#N/A"}},null,{"$f":"VLOOKUP(D121,AllDocs!A:D,2,0)","v":{"$error":"#N/A"}},{"$f":"VLOOKUP(D121,AllDocs!A:D,3,0)","v":{"$error":"#N/A"}},{"$f":"VLOOKUP(D121,AllDocs!A:D,4,0)","v":{"$error":"#N/A"}},null,{"$f":"VLOOKUP(D121,AllDocs!A:F,6,0)","v":{"$error":"#N/A"}}]
[null,{"$f":"VLOOKUP(A122,logistics!G:I,2,0)","v":{"$error":"#N/A"}},{"$f":"VLOOKUP(A122,logistics!G:I,3,0)","v":{"$error":"#N/A"}},null,{"$f":"VLOOKUP(D122,AllDocs!A:D,2,0)","v":{"$error":"#N/A"}},{"$f":"VLOOKUP(D122,AllDocs!A:D,3,0)","v":{"$error":"#N/A"}},{"$f":"VLOOKUP(D122,AllDocs!A:D,4,0)","v":{"$error":"#N/A"}},null,{"$f":"VLOOKUP(D122,AllDocs!A:F,6,0)","v":{"$error":"#N/A"}}]
[null,{"$f":"VLOOKUP(A123,logistics!G:I,2,0)","v":{"$error":"#N/A"}},{"$f":"VLOOKUP(A123,logistics!G:I,3,0)","v":{"$error":"#N/A"}},null,{"$f":"VLOOKUP(D123,AllDocs!A:D,2,0)","v":{"$error":"#N/A"}},{"$f":"VLOOKUP(D123,AllDocs!A:D,3,0)","v":{"$error":"#N/A"}},{"$f":"VLOOKUP(D123,AllDocs!A:D,4,0)","v":{"$error":"#N/A"}},null,{"$f":"VLOOKUP(D123,AllDocs!A:F,6,0)","v":{"$error":"#N/A"}}]
[null,{"$f":"VLOOKUP(A124,logistics!G:I,2,0)","v":{"$error":"#N/A"}},{"$f":"VLOOKUP(A124,logistics!G:I,3,0)","v":{"$error":"#N/A"}},null,{"$f":"VLOOKUP(D124,AllDocs!A:D,2,0)","v":{"$error":"#N/A"}},{"$f":"VLOOKUP(D124,AllDocs!A:D,3,0)","v":{"$error":"#N/A"}},{"$f":"VLOOKUP(D124,AllDocs!A:D,4,0)","v":{"$error":"#N/A"}},null,{"$f":"VLOOKUP(D124,AllDocs!A:F,6,0)","v":{"$error":"#N/A"}}]
[null,{"$f":"VLOOKUP(A125,logistics!G:I,2,0)","v":{"$error":"#N/A"}},{"$f":"VLOOKUP(A125,logistics!G:I,3,0)","v":{"$error":"#N/A"}},null,{"$f":"VLOOKUP(D125,AllDocs!A:D,2,0)","v":{"$error":"#N/A"}},{"$f":"VLOOKUP(D125,AllDocs!A:D,3,0)","v":{"$error":"#N/A"}},{"$f":"VLOOKUP(D125,AllDocs!A:D,4,0)","v":{"$error":"#N/A"}},null,{"$f":"VLOOKUP(D125,AllDocs!A:F,6,0)","v":{"$error":"#N/A"}}]
[null,{"$f":"VLOOKUP(A126,logistics!G:I,2,0)","v":{"$error":"#N/A"}},{"$f":"VLOOKUP(A126,logistics!G:I,3,0)","v":{"$error":"#N/A"}},null,{"$f":"VLOOKUP(D126,AllDocs!A:D,2,0)","v":{"$error":"#N/A"}},{"$f":"VLOOKUP(D126,AllDocs!A:D,3,0)","v":{"$error":"#N/A"}},{"$f":"VLOOKUP(D126,AllDocs!A:D,4,0)","v":{"$error":"#N/A"}},null,{"$f":"VLOOKUP(D126,AllDocs!A:F,6,0)","v":{"$error":"#N/A"}}]
[null,{"$f":"VLOOKUP(A127,logistics!G:I,2,0)","v":{"$error":"#N/A"}},{"$f":"VLOOKUP(A127,logistics!G:I,3,0)","v":{"$error":"#N/A"}},null,{"$f":"VLOOKUP(D127,AllDocs!A:D,2,0)","v":{"$error":"#N/A"}},{"$f":"VLOOKUP(D127,AllDocs!A:D,3,0)","v":{"$error":"#N/A"}},{"$f":"VLOOKUP(D127,AllDocs!A:D,4,0)","v":{"$error":"#N/A"}},null,{"$f":"VLOOKUP(D127,AllDocs!A:F,6,0)","v":{"$error":"#N/A"}}]
[null,{"$f":"VLOOKUP(A128,logistics!G:I,2,0)","v":{"$error":"#N/A"}},{"$f":"VLOOKUP(A128,logistics!G:I,3,0)","v":{"$error":"#N/A"}},null,{"$f":"VLOOKUP(D128,AllDocs!A:D,2,0)","v":{"$error":"#N/A"}},{"$f":"VLOOKUP(D128,AllDocs!A:D,3,0)","v":{"$error":"#N/A"}},{"$f":"VLOOKUP(D128,AllDocs!A:D,4,0)","v":{"$error":"#N/A"}},null,{"$f":"VLOOKUP(D128,AllDocs!A:F,6,0)","v":{"$error":"#N/A"}}]
[null,{"$f":"VLOOKUP(A129,logistics!G:I,2,0)","v":{"$error":"#N/A"}},{"$f":"VLOOKUP(A129,logistics!G:I,3,0)","v":{"$error":"#N/A"}},null,{"$f":"VLOOKUP(D129,AllDocs!A:D,2,0)","v":{"$error":"#N/A"}},{"$f":"VLOOKUP(D129,AllDocs!A:D,3,0)","v":{"$error":"#N/A"}},{"$f":"VLOOKUP(D129,AllDocs!A:D,4,0)","v":{"$error":"#N/A"}},null,{"$f":"VLOOKUP(D129,AllDocs!A:F,6,0)","v":{"$error":"#N/A"}}]
[null,{"$f":"VLOOKUP(A130,logistics!G:I,2,0)","v":{"$error":"#N/A"}},{"$f":"VLOOKUP(A130,logistics!G:I,3,0)","v":{"$error":"#N/A"}},null,{"$f":"VLOOKUP(D130,AllDocs!A:D,2,0)","v":{"$error":"#N/A"}},{"$f":"VLOOKUP(D130,AllDocs!A:D,3,0)","v":{"$error":"#N/A"}},{"$f":"VLOOKUP(D130,AllDocs!A:D,4,0)","v":{"$error":"#N/A"}},null,{"$f":"VLOOKUP(D130,AllDocs!A:F,6,0)","v":{"$error":"#N/A"}}]
[null,{"$f":"VLOOKUP(A131,logistics!G:I,2,0)","v":{"$error":"#N/A"}},{"$f":"VLOOKUP(A131,logistics!G:I,3,0)","v":{"$error":"#N/A"}},null,{"$f":"VLOOKUP(D131,AllDocs!A:D,2,0)","v":{"$error":"#N/A"}},{"$f":"VLOOKUP(D131,AllDocs!A:D,3,0)","v":{"$error":"#N/A"}},{"$f":"VLOOKUP(D131,AllDocs!A:D,4,0)","v":{"$error":"#N/A"}},null,{"$f":"VLOOKUP(D131,AllDocs!A:F,6,0)","v":{"$error":"#N/A"}}]
[null,{"$f":"VLOOKUP(A132,logistics!G:I,2,0)","v":{"$error":"#N/A"}},{"$f":"VLOOKUP(A132,logistics!G:I,3,0)","v":{"$error":"#N/A"}},null,{"$f":"VLOOKUP(D132,AllDocs!A:D,2,0)","v":{"$error":"#N/A"}},{"$f":"VLOOKUP(D132,AllDocs!A:D,3,0)","v":{"$error":"#N/A"}},{"$f":"VLOOKUP(D132,AllDocs!A:D,4,0)","v":{"$error":"#N/A"}},null,{"$f":"VLOOKUP(D132,AllDocs!A:F,6,0)","v":{"$error":"#N/A"}}]
[null,{"$f":"VLOOKUP(A133,logistics!G:I,2,0)","v":{"$error":"#N/A"}},{"$f":"VLOOKUP(A133,logistics!G:I,3,0)","v":{"$error":"#N/A"}},null,{"$f":"VLOOKUP(D133,AllDocs!A:D,2,0)","v":{"$error":"#N/A"}},{"$f":"VLOOKUP(D133,AllDocs!A:D,3,0)","v":{"$error":"#N/A"}},{"$f":"VLOOKUP(D133,AllDocs!A:D,4,0)","v":{"$error":"#N/A"}},null,{"$f":"VLOOKUP(D133,AllDocs!A:F,6,0)","v":{"$error":"#N/A"}}]
[null,{"$f":"VLOOKUP(A134,logistics!G:I,2,0)","v":{"$error":"#N/A"}},{"$f":"VLOOKUP(A134,logistics!G:I,3,0)","v":{"$error":"#N/A"}},null,{"$f":"VLOOKUP(D134,AllDocs!A:D,2,0)","v":{"$error":"#N/A"}},{"$f":"VLOOKUP(D134,AllDocs!A:D,3,0)","v":{"$error":"#N/A"}},{"$f":"VLOOKUP(D134,AllDocs!A:D,4,0)","v":{"$error":"#N/A"}},null,{"$f":"VLOOKUP(D134,AllDocs!A:F,6,0)","v":{"$error":"#N/A"}}]
[null,{"$f":"VLOOKUP(A135,logistics!G:I,2,0)","v":{"$error":"#N/A"}},{"$f":"VLOOKUP(A135,logistics!G:I,3,0)","v":{"$error":"#N/A"}},null,{"$f":"VLOOKUP(D135,AllDocs!A:D,2,0)","v":{"$error":"#N/A"}},{"$f":"VLOOKUP(D135,AllDocs!A:D,3,0)","v":{"$error":"#N/A"}},{"$f":"VLOOKUP(D135,AllDocs!A:D,4,0)","v":{"$error":"#N/A"}},null,{"$f":"VLOOKUP(D135,AllDocs!A:F,6,0)","v":{"$error":"#N/A"}}]
[null,{"$f":"VLOOKUP(A136,logistics!G:I,2,0)","v":{"$error":"#N/A"}},{"$f":"VLOOKUP(A136,logistics!G:I,3,0)","v":{"$error":"#N/A"}},null,{"$f":"VLOOKUP(D136,AllDocs!A:D,2,0)","v":{"$error":"#N/A"}},{"$f":"VLOOKUP(D136,AllDocs!A:D,3,0)","v":{"$error":"#N/A"}},{"$f":"VLOOKUP(D136,AllDocs!A:D,4,0)","v":{"$error":"#N/A"}},null,{"$f":"VLOOKUP(D136,AllDocs!A:F,6,0)","v":{"$error":"#N/A"}}]
[null,{"$f":"VLOOKUP(A137,logistics!G:I,2,0)","v":{"$error":"#N/A"}},{"$f":"VLOOKUP(A137,logistics!G:I,3,0)","v":{"$error":"#N/A"}},null,{"$f":"VLOOKUP(D137,AllDocs!A:D,2,0)","v":{"$error":"#N/A"}},{"$f":"VLOOKUP(D137,AllDocs!A:D,3,0)","v":{"$error":"#N/A"}},{"$f":"VLOOKUP(D137,AllDocs!A:D,4,0)","v":{"$error":"#N/A"}},null,{"$f":"VLOOKUP(D137,AllDocs!A:F,6,0)","v":{"$error":"#N/A"}}]
[null,{"$f":"VLOOKUP(A138,logistics!G:I,2,0)","v":{"$error":"#N/A"}},{"$f":"VLOOKUP(A138,logistics!G:I,3,0)","v":{"$error":"#N/A"}},null,{"$f":"VLOOKUP(D138,AllDocs!A:D,2,0)","v":{"$error":"#N/A"}},{"$f":"VLOOKUP(D138,AllDocs!A:D,3,0)","v":{"$error":"#N/A"}},{"$f":"VLOOKUP(D138,AllDocs!A:D,4,0)","v":{"$error":"#N/A"}},null,{"$f":"VLOOKUP(D138,AllDocs!A:F,6,0)","v":{"$error":"#N/A"}}]
[null,{"$f":"VLOOKUP(A139,logistics!G:I,2,0)","v":{"$error":"#N/A"}},{"$f":"VLOOKUP(A139,logistics!G:I,3,0)","v":{"$error":"#N/A"}},null,{"$f":"VLOOKUP(D139,AllDocs!A:D,2,0)","v":{"$error":"#N/A"}},{"$f":"VLOOKUP(D139,AllDocs!A:D,3,0)","v":{"$error":"#N/A"}},{"$f":"VLOOKUP(D139,AllDocs!A:D,4,0)","v":{"$error":"#N/A"}},null,{"$f":"VLOOKUP(D139,AllDocs!A:F,6,0)","v":{"$error":"#N/A"}}]
[null,{"$f":"VLOOKUP(A140,logistics!G:I,2,0)","v":{"$error":"#N/A"}},{"$f":"VLOOKUP(A140,logistics!G:I,3,0)","v":{"$error":"#N/A"}},null,{"$f":"VLOOKUP(D140,AllDocs!A:D,2,0)","v":{"$error":"#N/A"}},{"$f":"VLOOKUP(D140,AllDocs!A:D,3,0)","v":{"$error":"#N/A"}},{"$f":"VLOOKUP(D140,AllDocs!A:D,4,0)","v":{"$error":"#N/A"}},null,{"$f":"VLOOKUP(D140,AllDocs!A:F,6,0)","v":{"$error":"#N/A"}}]
[null,{"$f":"VLOOKUP(A141,logistics!G:I,2,0)","v":{"$error":"#N/A"}},{"$f":"VLOOKUP(A141,logistics!G:I,3,0)","v":{"$error":"#N/A"}},null,{"$f":"VLOOKUP(D141,AllDocs!A:D,2,0)","v":{"$error":"#N/A"}},{"$f":"VLOOKUP(D141,AllDocs!A:D,3,0)","v":{"$error":"#N/A"}},{"$f":"VLOOKUP(D141,AllDocs!A:D,4,0)","v":{"$error":"#N/A"}},null,{"$f":"VLOOKUP(D141,AllDocs!A:F,6,0)","v":{"$error":"#N/A"}}]
[null,{"$f":"VLOOKUP(A142,logistics!G:I,2,0)","v":{"$error":"#N/A"}},{"$f":"VLOOKUP(A142,logistics!G:I,3,0)","v":{"$error":"#N/A"}},null,{"$f":"VLOOKUP(D142,AllDocs!A:D,2,0)","v":{"$error":"#N/A"}},{"$f":"VLOOKUP(D142,AllDocs!A:D,3,0)","v":{"$error":"#N/A"}},{"$f":"VLOOKUP(D142,AllDocs!A:D,4,0)","v":{"$error":"#N/A"}},null,{"$f":"VLOOKUP(D142,AllDocs!A:F,6,0)","v":{"$error":"#N/A"}}]
[null,{"$f":"VLOOKUP(A143,logistics!G:I,2,0)","v":{"$error":"#N/A"}},{"$f":"VLOOKUP(A143,logistics!G:I,3,0)","v":{"$error":"#N/A"}},null,{"$f":"VLOOKUP(D143,AllDocs!A:D,2,0)","v":{"$error":"#N/A"}},{"$f":"VLOOKUP(D143,AllDocs!A:D,3,0)","v":{"$error":"#N/A"}},{"$f":"VLOOKUP(D143,AllDocs!A:D,4,0)","v":{"$error":"#N/A"}},null,{"$f":"VLOOKUP(D143,AllDocs!A:F,6,0)","v":{"$error":"#N/A"}}]
[null,{"$f":"VLOOKUP(A144,logistics!G:I,2,0)","v":{"$error":"#N/A"}},{"$f":"VLOOKUP(A144,logistics!G:I,3,0)","v":{"$error":"#N/A"}},null,{"$f":"VLOOKUP(D144,AllDocs!A:D,2,0)","v":{"$error":"#N/A"}},{"$f":"VLOOKUP(D144,AllDocs!A:D,3,0)","v":{"$error":"#N/A"}},{"$f":"VLOOKUP(D144,AllDocs!A:D,4,0)","v":{"$error":"#N/A"}},null,{"$f":"VLOOKUP(D144,AllDocs!A:F,6,0)","v":{"$error":"#N/A"}}]
[null,{"$f":"VLOOKUP(A145,logistics!G:I,2,0)","v":{"$error":"#N/A"}},{"$f":"VLOOKUP(A145,logistics!G:I,3,0)","v":{"$error":"#N/A"}},null,{"$f":"VLOOKUP(D145,AllDocs!A:D,2,0)","v":{"$error":"#N/A"}},{"$f":"VLOOKUP(D145,AllDocs!A:D,3,0)","v":{"$error":"#N/A"}},{"$f":"VLOOKUP(D145,AllDocs!A:D,4,0)","v":{"$error":"#N/A"}},null,{"$f":"VLOOKUP(D145,AllDocs!A:F,6,0)","v":{"$error":"#N/A"}}]
[null,{"$f":"VLOOKUP(A146,logistics!G:I,2,0)","v":{"$error":"#N/A"}},{"$f":"VLOOKUP(A146,logistics!G:I,3,0)","v":{"$error":"#N/A"}},null,{"$f":"VLOOKUP(D146,AllDocs!A:D,2,0)","v":{"$error":"#N/A"}},{"$f":"VLOOKUP(D146,AllDocs!A:D,3,0)","v":{"$error":"#N/A"}},{"$f":"VLOOKUP(D146,AllDocs!A:D,4,0)","v":{"$error":"#N/A"}},null,{"$f":"VLOOKUP(D146,AllDocs!A:F,6,0)","v":{"$error":"#N/A"}}]

{"sheet":"logistics","index":1,"n_rows":32,"n_cols":13,"rows_kept":32,"cut":false,"hidden":false,"merged":[]}
["WeekDay","SlotTime","Day","Slot","Time","AllSlots","MAS Slots","Rooms","WGs","WIs","Short Name","Deadline","non-duplicated contribution number"]
["Mon","9:00-10:30","Mon",1,"9:00-10:30",{"$f":"CONCATENATE(C2,\"-\",D2,\" (\",E2,\")\")","v":"Mon-1 (9:00-10:30)"},{"$f":"IF(COUNTA(I2),CELL(\"contents\",F2),\"\")","v":""},null,null,"TR-0001 (WI-0015)","Use Case Continuation","2017-05-15T01:00:00",{"$f":"SUMPRODUCT(1/COUNTIF('Document Allocation'!D2:D112,'Document Allocation'!D2:D112))","v":83.075675675675654}]
["Tue","10:30-11:00","Mon",2,"11:00-12:30","Mon-2 (11:00-12:30)",{"$f":"IF(COUNTA(I3),CELL(\"contents\",F3),\"\")","v":""},null,null,"TR-0007 (WI-0053)","Semantic Study",null," "]
["Wed","11:00-12:30","Mon",3,"13:30-15:00",{"$f":"CONCATENATE(C4,\"-\",D4,\" (\",E4,\")\")","v":"Mon-3 (13:30-15:00)"},"",null,null,"TR-0014 (WI-0018)","oneM2M AllJoyn Interworking"]
["Thu","12:30-13:30","Mon",4,"15:30-17:00",{"$f":"CONCATENATE(C5,\"-\",D5,\" (\",E5,\")\")","v":"Mon-4 (15:30-17:00)"},{"$f":"IF(COUNTA(I5),CELL(\"contents\",F5),\"\")","v":"Mon-4 (15:30-17:00)"},"MADRID 3","MAS","TR-0017 (WI-0017)","Home Domain Abstract Information Model"]
["Fri","13:30-15:00","Mon",5,"17:00-18:30","Mon-5 (17:00-18:30)","Mon-5 (17:00-18:30)","MADRID 5 ","MAS-adhoc","TR-0018 (WI-0059)","Industry Domain Enablement"]
[null,"15:00-15:30","Tue",1,"08:30-10:00","Tue-1 (08:30-10:00)","",null,null,"TR-0022 (WI-0043)","Continuation & integration of HGI Smart Home activities"]
[null,"15:30-17:00","Tue",2,"10:30-12:00","Tue-2 (10:30-12:00)","Tue-2 (10:30-12:00)","MADRID 3","MAS","TR-0031 (WI-0052)","LWM2M DM Interworking Enhancement"]
[null,"17:00-18:30","Tue",3,"13:30-15:00",{"$f":"CONCATENATE(C9,\"-\",D9,\" (\",E9,\")\")","v":"Tue-3 (13:30-15:00)"},"",null,null,"TR-0039 (WI-0054)","Developer guide-SDT-based implementation"]
[null,null,"Tue",4,"15:30-17:00","Tue-4 (15:30-17:00)","Tue-4 (15:30-17:00)","MADRID 3","MAS","TR-0033 (WI-0053)","Study on Enhanced Semantic Enablement"]
[null,"08:30-10:00","Tue",5,"17:00-18:30","Tue-5 (17:00-18:30)","Tue-5 (17:00-18:30)","MADRID 2","ARC/MAS","TR-0042 (WI-0071)","WoT Interworking"]
[null,"10:00-10:30","Wed",1,"08:30-10:00","Wed-1 (08:30-10:00)","",null,null,"TR-0043 (WI-0072)","Modbus Interworking"]
[null,"10:30-12:00","Wed",2,"10:30-12:00","Wed-2 (10:30-12:00)","",null,null,"TR-0045 (WI-0054)","Developer Guide: Implementing Semantics"]
[null,"12:00-13:30","Wed",3,"13:30-15:00","Wed-3 (13:30-15:00)","",null,null,"TR-0046 (WI-0070)","Study on Disaster Alert Service Enabler"]
[null,"13:30-15:00","Wed",4,"15:30-17:00","Wed-4 (15:30-17:00)","",null,null,"TS-0001 (WI-0002)","Architecture"]
[null,"15:00-15:30","Wed",5,"17:00-18:30","Wed-5 (17:00-18:30)","",null,null,"TS-0002 (WI-0001)","Requirement"]
[null,"15:30-17:00","Thu",1,"08:30-10:00","Thu-1 (08:30-10:00)",{"$f":"IF(COUNTA(I17),CELL(\"contents\",F17),\"\")","v":"Thu-1 (08:30-10:00)"},"MADRID 2","ARC/MAS","TS-0004 (WI-0009)","Protocol Core"]
[null,"17:00-18:30","Thu",2,"10:30-12:00","Thu-2 (10:30-12:00)",{"$f":"IF(COUNTA(I18),CELL(\"contents\",F18),\"\")","v":"Thu-2 (10:30-12:00)"},"MADRID 5 ","MAS-adhoc","TS-0005 (WI-0010)","OMA Mapping"]
[null,null,"Thu",3,"13:30-15:00","Thu-3 (13:30-15:00)",{"$f":"IF(COUNTA(I19),CELL(\"contents\",F19),\"\")","v":"Thu-3 (13:30-15:00)"},"MADRID 3","MAS","TS-0006 (WI-0010)","BBF Mapping"]
[null,null,"Thu",4,"15:30-17:00","Thu-4 (15:30-17:00)","",null,null,"TS-0007 (WI-0011)","SOA Architecture"]
[null,null,"Thu",5,"17:00-18:30","Thu-5 (17:00-18:30)","",null,null,"TS-0009 (WI-0013)","HTTP Binding"]
[null,null,"Thu",6,"18:30-20:00",{"$f":"CONCATENATE(C22,\"-\",D22,\" (\",E22,\")\")","v":"Thu-6 (18:30-20:00)"},{"$f":"IF(COUNTA(I22),CELL(\"contents\",F22),\"\")","v":""},null,null,"TS-0012 (WI-0063)","oneM2M Base Ontology"]
[null,null,"Fri",1,"08:30-10:00","Fri-1 (08:30-10:00)","",null,null,"TS-0014 (WI-0024)","LWM2M_Interworking"]
[null,null,"Fri",2,"10:30-12:00","Fri-2 (10:30-12:00)","",null,null,"TS-0022 (WI-0030)","Field Device Configuration "]
[null,null,"Fri",3,"13:30-15:00","Fri-3 (13:30-15:00)","",null,null,"TS-0023 (WI-0056)","Home Appliances Information Model and Mapping"]
[null,null,"Fri",4,"15:30-17:00","Fri-4 (15:30-17:00)","",null,null,"TS-0030 (WI-0063)","Generic Interworking"]
[null,null,null,null,null,"- ()","",null,null,"TS-0033 (WI-0056)","Proximal Interworking"]
[null,null,null,null,null,null,"",null,null,"TS-0034 (WI-0053)","Semantic Support"]
[null,null,null,null,null,null,"",null,null,"Generic"]
[null,null,null,null,null,null,{"$f":"IF(COUNTA(I30),CELL(\"contents\",F30),\"\")","v":""}]
[null,null,null,null,null,null,""]
[null,null,null,null,null,null,""]

{"sheet":"AllDocs","index":2,"n_rows":265,"n_cols":8,"rows_kept":265,"cut":false,"hidden":false,"merged":[]}
["SHORT DOC NB","SHORTNAME","SOURCE","UPLOADED","STATUS","DOC TYPE","VERS","MEETING"]
["TP-2017-0054","Invitation_to_TP29_Shenzhen_China","CCSA","2017-02-24T08:05:07","Noted","INV",null,"TP 29"]
["ARC-2017-0149","TR-0020 0.7.0 new baseline","Huawei Technologies Co., Ltd.","2017-04-01T13:54:07","Agreed","INC",null,"ARC 29"]
["TP-2017-0101","Reply LS to GSMA Mobile IoT response to oneM2M","3GPP SA2","2017-04-04T12:41:03","Noted","LS",null,"TP 29"]
["REQ-2017-0029R01","Draft-TR-0026-Vehicular_Domain_Enablement_v_0_8_0","KDDI, Huawei Technologies, LG Electronics","2017-04-06T00:50:19","Agreed","CR",null,"REQ 29"]
["TP-2017-0102","ETSI ISG MEC (Multi access Edge Computing) Phase 2","ETSI ISG MEC","2017-04-06T12:53:39","Noted","LS",null,"TP 29"]
["TP-2017-0103","LS on the new structure of ITU-T SG20","ITU-T SG20","2017-04-10T08:30:51","Noted","LS",null,"TP 29"]
["REQ-2017-0030","TR026 to TS002 new reqs already implemented","Convida","2017-04-10T17:29:43","Draft","CR",null,"REQ 29"]
["REQ-2017-0031","TR026 to TS002 new reqs not implemented","Convida","2017-04-10T17:29:56","Draft","CR",null,"REQ 29"]
["TP-2017-0106","Voting List for TP29","Karen Hughes, Secretariat","2017-04-19T14:10:19","Noted","INC",null,"TP 29"]
["TP-2017-0106R01","Voting List for TP29","Karen Hughes, Secretariat","2017-04-20T06:22:55","Approved","INC",null,"TP 29"]
["REQ-2017-0032","Draft-TR-0026-Vehicular_Domain_Enablement_v_0_8_1","KDDI, Huawei Technologies, LG Electronics","2017-04-26T13:16:27","Agreed","CR",null,"REQ 29"]
["MAS-2017-0087","Discussion on current and target data points","Andreas Kraft (Deutsche Telekom)","2017-05-03T11:53:47","Postponed","INC",null,"MAS 29"]
["MAS-2017-0088","Adding a new ModuleClass for retrieving and setting movement information","Andreas Kraft (Deutsche Telekom)","2017-05-03T11:55:16","Noted","CR",null,"MAS 29"]
["MAS-2017-0058R03","Adding geoLocation to TS-0023","Andreas Kraft (Deutsche Telekom)","2017-05-03T11:56:14","Agreed","CR",null,"MAS 29"]
["TST-2017-0135","Analysis_of_missing_TPs_v0_2","Keebum Kim , TTA","2017-05-10T12:28:56","Draft","INC",null,"TST 29"]
["MAS-2017-0093","WoT Interworking Scenarios","Yongjing Zhang (Huawei)","2017-05-10T15:45:57","Draft","INC",null,"MAS 29"]
["TST-2017-0136","Requirements_Management_tool_SquashTM","Easy Global Market","2017-05-11T13:36:39","Draft","INC",null,"TST 29"]
["TST-2017-0137","Requirements_Management_tool_SquashTM","Easy Global Market","2017-05-11T13:38:46","Withdrawn","INC",null,"TST 29"]
["MAS-2017-0094","WoT Interworking Background for TR-0042","Convida, Huawei","2017-05-11T17:36:23","Noted","CR",null,"MAS 29"]
["PRO-2017-0092","Updated reference for CoAP on Rel-1","KT","2017-05-12T01:23:59","Draft","CR",null,"PRO 29"]
["PRO-2017-0093","Updated reference for CoAP on Rel-2","KT","2017-05-12T01:27:38","Draft","CR",null,"PRO 29"]
["ARC-2017-0174","TR-0018_New_Baseline","Hitachi","2017-05-12T01:32:09","Noted","CR",null,"ARC 29"]
["ARC-2017-0175","OPC-UA IWK Possible Impacts on oneM2M","Hitachi","2017-05-12T01:35:53","Noted","INC",null,"ARC 29"]
["PRO-2017-0094","MQTT server co-located within a node on Rel-1","KT","2017-05-12T01:50:07","Draft","CR",null,"PRO 29"]
["PRO-2017-0095","MQTT server co-located within a node on Rel-2","KT","2017-05-12T01:51:53","Draft","CR",null,"PRO 29"]
["PRO-2017-0096","MQTT server located independently from nodes on Rel-1","KT","2017-05-12T02:05:54","Draft","CR",null,"PRO 29"]
["PRO-2017-0097","MQTT server located independently from nodes on Rel-2","KT","2017-05-12T02:08:22","Draft","CR",null,"PRO 29"]
["PRO-2017-0098","Connecting to MQTT on Rel-1","KT","2017-05-12T02:23:58","Draft","CR",null,"PRO 29"]
["PRO-2017-0099","Connecting to MQTT on Rel-2","KT","2017-05-12T02:26:16","Draft","CR",null,"PRO 29"]
["ARC-2017-0176","Identifier_expression_in_common_attribute","NTT","2017-05-12T03:56:19","Draft","INC",null,"ARC 29"]
["PRO-2017-0100","MQTT Request and Response Messages on Rel-1","KT","2017-05-12T04:23:20","Draft","CR",null,"PRO 29"]
["PRO-2017-0101","MQTT Request and Response Messages on Rel-2","KT","2017-05-12T04:25:06","Draft","CR",null,"PRO 29"]
["PRO-2017-0102","MQTT Sending a Request on Rel-1","KT","2017-05-12T04:37:51","Draft","CR",null,"PRO 29"]
["PRO-2017-0103","MQTT Sending a Request on Rel-2","KT","2017-05-12T04:41:35","Draft","CR",null,"PRO 29"]
["PRO-2017-0104","Listening for and responding to a Request on Rel-1","KT","2017-05-12T04:47:08","Draft","CR",null,"PRO 29"]
["PRO-2017-0105","Listening for and responding to a Request on Rel-2","KT","2017-05-12T04:49:36","Draft","CR",null,"PRO 29"]
["PRO-2017-0106","MQTT Request/Response Message Flow on Rel-1","KT","2017-05-12T05:02:18","Draft","CR",null,"PRO 29"]
["PRO-2017-0106R01","MQTT Request/Response Message Flow on Rel-1","KT","2017-05-12T05:08:39","Draft","CR",null,"PRO 29"]
["PRO-2017-0107","MQTT Request/Response Message Flow on Rel-2","KT","2017-05-12T05:13:08","Draft","CR",null,"PRO 29"]
["PRO-2017-0060R02","Resource Type group Rel-3","KT","2017-05-12T05:22:26","Draft","CR",null,"PRO 29"]
["SEC-2017-0062","Update specification distributed authorization into clause 7","Datang","2017-05-12T07:11:27","Draft","CR",null,"SEC 29"]
["SEC-2017-0063","Distributed authorization resource lifecycle description","Datang","2017-05-12T07:14:04","Draft","CR",null,"SEC 29"]
["ARC-2017-0177","Changing Distributed Authorization Resources","Datang","2017-05-12T07:27:20","Draft","CR",null,"ARC 29"]
["ARC-2017-0178","Changing Distributed Authorization Resource Procedures","Datang","2017-05-12T07:32:56","Draft","CR",null,"ARC 29"]
["ARC-2017-0179","Updating Distributed Authorization Clause11","Datang","2017-05-12T07:36:20","Draft","CR",null,"ARC 29"]
["PRO-2017-0108","Distributed Authorization R3","Datang","2017-05-12T08:26:09","Draft","CR",null,"PRO 29"]
["ARC-2017-0180","Increasing_the usage_flexibility_of_timeSeries_and_timeSeriesInstance","NTT","2017-05-12T09:00:46","Noted","CR",null,"ARC 29"]
["ARC-2017-0181","Adding_common_attributes_for_interworking","NTT","2017-05-12T09:05:32","Draft","CR",null,"ARC 29"]
["ARC-2017-0182","Operation_Execution_Time_update","ZTE","2017-05-12T09:07:37","Noted","CR",null,"ARC 29"]
["MAS-2017-0095","Adding_omaDevice_module _to_TS-0023","NTT","2017-05-12T09:08:39","Noted","CR",null,"MAS 29"]
["ARC-2017-0183","Modbus_Interworking_Scenarios","ZTE","2017-05-12T09:14:01","Noted","INC",null,"ARC 29"]
["MAS-2017-0096","Semantic Mashup for TS-0034","Convida","2017-05-12T13:36:37","Draft","CR",null,"MAS 29"]
["TP-2017-0108","Work Program Status TP#29 opening","Roland Hechwartner, WPM convenor","2017-05-12T13:50:33","Noted","STR",null,"TP 29"]
["SEC-2017-0064","CR TS-0003 R3 PKI SE Framework completion","Gemalto","2017-05-12T16:13:06","Draft","CR",null,"SEC 29"]
["MAS-2017-0097","Request Parameter for Semantic Query for TR-0033","Convida","2017-05-12T17:01:20","Draft","CR",null,"MAS 29"]
["ARC-2017-0191","Semantic Query and Semantic Content","NEC","2017-05-12T17:15:01","Draft","INC",null,"ARC 29"]
["ARC-2017-0192","mgmtObj_objectID_attribute","Convida","2017-05-12T18:45:03","Draft","CR",null,"ARC 29"]
["MAS-2017-0100","Guidelines_for_Mapping_ LWM2M_Objects","Convida","2017-05-12T18:49:57","Draft","CR",null,"MAS 29"]
["MAS-2017-0101","TS-0014_Updates_for_LWM2M_Interworking_with_mgmtObjects","Convida","2017-05-12T18:52:20","Draft","CR",null,"MAS 29"]
["ARC-2017-0193","Service_Enabled_AE","Convida","2017-05-12T18:56:23","Noted","CR",null,"ARC 29"]
["TP-2017-0109","Release 3 Summary","TP VC / ARC VC","2017-05-12T19:47:09","Noted","INC",null,"TP 29"]
["ARC-2017-0194","TR-0020_transaction_management_solution","Convida","2017-05-12T20:00:42","Noted","CR",null,"ARC 29"]
["ARC-2017-0115R03","Resource Type group Rel-3","KT","2017-05-14T11:01:50","Noted","CR",null,"ARC 29"]
["SEC-2017-0065","CR TR-0041 Algorithm details","Huawei","2017-05-14T12:43:12","Draft","CR",null,"SEC 29"]
["ARC-2017-0195","Proximal_IoT_Interworking_solution_discussion","Huawei Technologies Co., Ltd.","2017-05-14T15:01:25","Draft","INC",null,"ARC 29"]
["ARC-2017-0196","OSGi_oneM2M_service_mapping","Huawei Technologies Co., Ltd.","2017-05-14T15:02:44","Noted","INC",null,"ARC 29"]
["ARC-2017-0197","Modbus_Interworking_solutions","ZTE","2017-05-14T15:15:24","Noted","INC",null,"ARC 29"]
["SEC-2017-0061R02","CR_TS-0003_R2_Correction_to_Access_Control_mechanism","Qualcomm Inc. (TIA)","2017-05-14T20:19:45","Noted","CR",null,"SEC 29"]
["SEC-2017-0066","TS-0032_addressing_editors_notes","Qualcomm Inc. (TIA)","2017-05-14T20:52:32","Draft","INC",null,"SEC 29"]
["ARC-2017-0047R01","TS-0026_Background_Data_Transfer","Convida","2017-05-14T21:01:21","Noted","CR",null,"ARC 29"]
["ARC-2017-0198","BDT approaches discussion","Convida","2017-05-14T21:01:40","Noted","INC",null,"ARC 29"]
["ARC-2017-0199","TR-0026 time sync key issue","Convida","2017-05-14T21:01:57","Draft","CR",null,"ARC 29"]
["ARC-2017-0200","TS-0001 maintaining AE contact solution from TR-0026","Convida","2017-05-14T21:02:18","Draft","CR",null,"ARC 29"]
["ARC-2017-0201","TS-0001 filtering clarifications and enhancements","Convida","2017-05-14T21:03:09","Draft","CR",null,"ARC 29"]
["ARC-2017-0202","contentInstance immutability discussion","Convida","2017-05-14T21:03:27","Draft","AG",null,"ARC 29"]
["PRO-2017-0111","XSD_descriptorRepresentation_correction_R2","Qualcomm Inc. (TIA)","2017-05-14T21:28:00","Draft","CR",null,"PRO 29"]
["PRO-2017-0110","XSD_descriptorRepresentation_correction_R3","Qualcomm Inc. (TIA)","2017-05-14T21:28:17","Draft","CR",null,"PRO 29"]
["ARC-2017-0203","TR-0044 Introduction to heterogeneous identification service","Computer Network Information Center, Chinese Academy of Sciences (CNIC)","2017-05-14T22:02:25","Draft","INC",null,"ARC 29"]
["ARC-2017-0204","TR-0044 Existing technologies","Computer Network Information Center, Chinese Academy of Sciences (CNIC)","2017-05-14T22:08:29","Draft","INC",null,"ARC 29"]
["ARC-2017-0205","TR-0044 Use cases analysis","Computer Network Information Center, Chinese Academy of Sciences (CNIC)","2017-05-14T22:11:56","Draft","INC",null,"ARC 29"]
["ARC-2017-0206","TR-0044 Potential enhancements","Computer Network Information Center, Chinese Academy of Sciences (CNIC)","2017-05-14T22:14:53","Draft","INC",null,"ARC 29"]
["ARC-2017-0184","StorageBasedEventClarification_R3","Convida","2017-05-15T00:26:12","Noted","CR",null,"ARC 29"]
["ARC-2017-0185","GroupTimeOutForAggregatingNotifications_R3","Convida","2017-05-15T00:26:49","Draft","CR",null,"ARC 29"]
["ARC-2017-0186","ContainerDeleteDNSTypo_R3","Convida","2017-05-15T00:27:21","Draft","CR",null,"ARC 29"]
["ARC-2017-0187","ContainerDeleteDNSTypo_R2","Convida","2017-05-15T00:27:51","Draft","CR",null,"ARC 29"]
["ARC-2017-0188","CollectedEntityIDAttributeTypeChange_R3","Convida","2017-05-15T00:28:27","Draft","CR",null,"ARC 29"]
["ARC-2017-0189","CollectedEntityIDAttributeTypeChange_R2","Convida","2017-05-15T00:29:17","Draft","CR",null,"ARC 29"]
["ARC-2017-0190","ContentSerialization_R3","Convida","2017-05-15T00:29:55","Draft","CR",null,"ARC 29"]
["ARC-2017-0188R01","CollectedEntityIDAttributeTypeChange_R3","Convida","2017-05-15T00:35:31","Draft","CR",null,"ARC 29"]
["PRO-2017-0109","ContentSerialization_R3","Convida","2017-05-15T00:36:35","Draft","CR",null,"PRO 29"]
["ARC-2017-0207","adding condition tags equality cases","BOE","2017-05-15T01:52:24","Draft","CR",null,"ARC 29"]
["ARC-2017-0208","adding condition tags equality cases mirror R1","BOE","2017-05-15T01:57:16","Draft","CR",null,"ARC 29"]
["ARC-2017-0209","adding condition tags equality cases mirror R2","BOE","2017-05-15T01:58:38","Draft","CR",null,"ARC 29"]
["MAS-2017-0102","HAIM_modification_for_airPurifier_model","LG Electronics","2017-05-15T06:01:49","Agreed","CR",null,"MAS 29"]
["MAS-2017-0108","HAIM_modification_for_clothesDryer_model","LG Electronics","2017-05-15T06:02:26","Agreed","CR",null,"MAS 29"]
["MAS-2017-0109","HAIM_modification_for_TV_model","LG Electronics","2017-05-15T06:03:00","Draft","CR",null,"MAS 29"]
["PRO-2017-0112","Correction_of_Resource_handling_procedure_of_Receiver_for_flexBlocking(R1)","KT","2017-05-15T06:05:59","Draft","CR",null,"PRO 29"]
["PRO-2017-0113","Correction_of_Resource_handling_procedure_of_Receiver_for_flexBlocking(R2)","KT","2017-05-15T06:07:55","Draft","CR",null,"PRO 29"]
["PRO-2017-0114","Correction_of_Resource_handling_procedure_of_Receiver_for_flexBlocking(R3)_mirror","KT","2017-05-15T06:09:14","Draft","CR",null,"PRO 29"]
["MAS-2017-0104","HAIM_modification_for_dehumidifier_model","LG Electronics","2017-05-15T06:18:35","Draft","CR",null,"MAS 29"]
["MAS-2017-0106","HAIM_modification_for_freezer_model","LG Electronics","2017-05-15T07:03:16","Noted","CR",null,"MAS 29"]
["MAS-2017-0107","HAIM_modification_for_printMultiFunction_model","LG Electronics","2017-05-15T08:12:27","Draft","CR",null,"MAS 29"]
["TP-2017-0110","LS_to_OMA-DM_on_EventLog_LwM2M_Objects","Huawei Technologies Co., Ltd.","2017-05-15T08:30:13","Noted","LS",null,"TP 29"]
["ARC-2017-0214","MulticastGroupCreationEditableUpdate","Huawei Technologies Co., Ltd.","2017-05-15T08:47:45","Draft","CR",null,"ARC 29"]
["ARC-2017-0213","MulticastGroupFanoutEditableUpdate","Huawei Technologies Co., Ltd.","2017-05-15T08:48:29","Draft","CR",null,"ARC 29"]
["ARC-2017-0212","schedule synchronization between CSE and RemoteCSE","Huawei Technologies Co., Ltd.","2017-05-15T08:51:02","Draft","CR",null,"ARC 29"]
["ARC-2017-0211","TR-0024-UE Location Reporting Solution","Huawei Technologies Co., Ltd.","2017-05-15T08:51:35","Draft","CR",null,"ARC 29"]
["ARC-2017-0210","MonitoringEvent(UE Reachability)","Huawei Technologies Co., Ltd.","2017-05-15T08:51:59","Noted","CR",null,"ARC 29"]
["MAS-2017-0118","LwM2M_Event_Log_Mapping","Huawei Technologies Co., Ltd.","2017-05-15T09:02:53","Draft","CR",null,"MAS 29"]
["ARC-2017-0215","Solutions for DDS based direct change of data between oneM2M entities","Huawei Technologies Co., Ltd.","2017-05-15T09:18:55","Draft","INC",null,"ARC 29"]
["ARC-2017-0216","DDS solution proof material","Huawei Technologies Co., Ltd.","2017-05-15T09:49:59","Draft","INC",null,"ARC 29"]
["ARC-2017-0217","Device representation in oneM2M","Huawei Technologies Co., Ltd.","2017-05-15T11:50:28","Draft","INC",null,"ARC 29"]
["MAS-2017-0116","CR TS-0012 minor corrections to the base ontology","NEC","2017-05-15T12:33:18","Agreed","AG",null,"MAS 29"]
["TP-2017-0062R02","Newbies Session","Roland Hechwartner, Deutsche Telekom","2017-05-15T13:39:34","Draft","INC",null,"TP 29"]
["SEC-2017-0064R01","CR TS-0003 R3 PKI SE Framework completion","Gemalto","2017-05-15T14:38:14","Noted","CR",null,"SEC 29"]
["MAS-2017-0103","HAIM_modification_for_airQualityMon_model","LG Electronics","2017-05-16T06:59:50","Agreed","CR",null,"MAS 29"]
["SEC-2017-0068","Overview_on_Decentralized_Authentication","Huawei","2017-05-16T07:48:29","Draft","INC",null,"SEC 29"]
["ARC-2017-0217R01","Device representation in oneM2M","Huawei Technologies Co., Ltd.","2017-05-16T08:42:51","Draft","INC",null,"ARC 29"]
["MAS-2017-0120","TS-0006-Management_enablement_(BBF)-V3_3_0-Draft-Baseline","Timothy Carey, Nokia","2017-05-16T13:25:49","Noted","INC",null,"MAS 29"]
["ARC-2017-0218","OSGi_oneM2M_service_mapping","Huawei Technologies Co., Ltd.","2017-05-17T03:18:09","Draft","INC",null,"ARC 29"]
["TP-2017-0111","Update_on_WI_0048_OSGi_Interworking","Huawei Technologies Co., Ltd.","2017-05-17T03:20:00","Noted","INC",null,"TP 29"]
["ARC-2017-0219","Update on oneM2M features","Huawei Technologies Co., Ltd.","2017-05-18T07:04:06","Draft","INC",null,"ARC 29"]
["TP-2017-0113","Weekly Schedule TP29","Karen Hughes, Secretariat","2017-05-18T08:17:47","Noted","INC",null,"TP 29"]
["ARC-2017-0221","non-blocking cleanup (rel-2)","KETI","2017-05-18T09:40:27","Draft","INC",null,"ARC 29"]
["ARC-2017-0222","originator context info of ACP (rel-2)","KETI","2017-05-18T09:40:49","Noted","INC",null,"ARC 29"]
["MAS-2017-0092","MAS#29 Doc allocation","Yongjing Zhang (Huawei, MAS Chair)","2017-05-18T10:00:55","Draft","AG",null,"MAS 29"]
["MAS-2017-0091","MAS#29 Agenda","Yongjing Zhang (Huawei, MAS Chair)","2017-05-18T10:01:07","Draft","AG",null,"MAS 29"]
["SEC-2017-0067","SEC 29 agenda","WG Chair (Gemalto)","2017-05-18T11:16:02","Draft","AG",null,"SEC 29"]
["ARC-2017-0224","key value pair query","Huawei Technologies Co., Ltd.","2017-05-18T11:43:05","Draft","CR",null,"ARC 29"]
["TP-2017-0113R01","Weekly Schedule TP29","Karen Hughes, Secretariat","2017-05-18T13:19:17","Noted","INC",null,"TP 29"]
["ARC-2017-0220","discussions on AE registration","KETI","2017-05-18T14:41:13","Draft","INC",null,"ARC 29"]
["SEC-2017-0067R01","SEC 29 agenda","WG Chair (Gemalto)","2017-05-18T16:12:26","Draft","AG",null,"SEC 29"]
["TP-2017-0114","KEPCO_e-IoT_deployment","KEPCO, ETRI","2017-05-18T23:15:03","Draft","INC",null,"TP 29"]
["ARC-2017-0218R01","OSGi_oneM2M_service_mapping","Huawei Technologies Co., Ltd.","2017-05-19T02:52:54","Draft","INC",null,"ARC 29"]
["ARC-2017-0223","TR-0026 new solution for cross-resource subscription","KETI","2017-05-19T03:01:56","Draft","INC",null,"ARC 29"]
["MAS-2017-0092R01","MAS#29 Doc allocation","Yongjing Zhang (Huawei, MAS Chair)","2017-05-19T03:41:14","Draft","AG",null,"MAS 29"]
["MAS-2017-0093R01","WoT Interworking Scenarios","Yongjing Zhang (Huawei)","2017-05-19T04:22:32","Agreed","INC",null,"MAS 29"]
["MAS-2017-0115","HAIM modification for set top box model","QUALCOMM Inc. (TIA)","2017-05-19T05:11:14","Draft","CR",null,"MAS 29"]
["MAS-2017-0114","HAIM modification for food prove model","QUALCOMM Inc. (TIA)","2017-05-19T05:48:54","Draft","CR",null,"MAS 29"]
["ARC-2017-0225","ARC_29_0_Agenda","ARC VC","2017-05-19T14:58:33","Draft","AG",null,"ARC 29"]
["ARC-2017-0226","ARC_29_0_Document_Allocation","ARC VC","2017-05-19T14:58:55","Noted","AG",null,"ARC 29"]
["TP-2017-0115","ARC_28_Interim_CR_Pack_TS-0001","ARC Vice Chair","2017-05-19T15:15:59","Agreed","INC",null,"TP 29"]
["MAS-2017-0117","New type definitions for Generic Interworking","NEC","2017-05-19T21:19:53","Noted","INC",null,"MAS 29"]
["TP-2017-0116","IETF Workshop on IoT Semantic/Hypermedia Interoperability","Timothy Carey, Nokia","2017-05-20T04:02:52","Noted","INC",null,"TP 29"]
["ARC-2017-0227","TS-0001-schedule_updating_for_MonitoringEvent(UE_Reachability)","Huawei Technologies Co., Ltd.","2017-05-20T08:05:57","Draft","CR",null,"ARC 29"]
["ARC-2017-0210R01","MonitoringEvent(UE Reachability)","Huawei Technologies Co., Ltd.","2017-05-20T08:28:26","Draft","CR",null,"ARC 29"]
["ARC-2017-0211R01","TR-0024-UE Location Reporting Solution","Huawei Technologies Co., Ltd.","2017-05-20T08:30:16","Noted","CR",null,"ARC 29"]
["ARC-2017-0212R01","schedule synchronization between CSE and RemoteCSE","Huawei Technologies Co., Ltd.","2017-05-20T08:30:46","Noted","CR",null,"ARC 29"]
["ARC-2017-0216R01","DDS solution proof material","Huawei Technologies Co., Ltd.","2017-05-20T09:42:09","Draft","INC",null,"ARC 29"]
["MAS-2017-0118R01","LwM2M_Event_Log_Mapping","Huawei Technologies Co., Ltd.","2017-05-20T10:51:22","Draft","CR",null,"MAS 29"]
["TP-2017-0110R01","LS_to_OMA-DM_on_EventLog_LwM2M_Objects","Huawei Technologies Co., Ltd.","2017-05-20T10:51:59","Noted","LS",null,"TP 29"]
["TP-2017-0112","Agenda TP29","Omar Elloumi, TP Chair","2017-05-21T06:29:05","Agreed","AG",null,"TP 29"]
["TP-2017-0113R02","Weekly Schedule TP29","Karen Hughes, Secretariat","2017-05-21T06:33:35","Noted","INC",null,"TP 29"]
["TP-2017-0113R03","Weekly Schedule TP29","Karen Hughes, Secretariat","2017-05-21T08:50:59","Noted","INC",null,"TP 29"]
["ARC-2017-0226R01","ARC_29_0_Document_Allocation","ARC VC","2017-05-21T15:41:09","Noted","AG",null,"ARC 29"]
["TP-2017-0111R01","Update_on_WI_0048_OSGi_Interworking","Huawei Technologies Co., Ltd.","2017-05-22T01:01:24","Noted","INC",null,"TP 29"]
["ARC-2017-0174R01","TR-0018_New_Baseline-V2_4_0","Hitachi","2017-05-22T01:03:37","Noted","CR",null,"ARC 29"]
["SEC-2017-0067R02","SEC 29 agenda","WG Chair (Gemalto)","2017-05-22T02:15:36","Draft","AG",null,"SEC 29"]
["SEC-2017-0070","CR_TS-0003_R2_clause_8_8_3","Qualcomm Inc. (TIA)","2017-05-22T02:29:27","Draft","CR",null,"SEC 29"]
["SEC-2017-0066R01","TS-0032_addressing_editors_notes","Qualcomm Inc. (TIA)","2017-05-22T03:04:36","Draft","INC",null,"SEC 29"]
["MAS-2017-0118R02","LwM2M_Event_Log_Mapping","Huawei Technologies Co., Ltd.","2017-05-22T03:47:11","Noted","CR",null,"MAS 29"]
["SEC-2017-0067R03","SEC 29 agenda","WG Chair (Gemalto)","2017-05-22T04:12:42","Agreed","AG",null,"SEC 29"]
["SEC-2017-0069","CR TS-0003 MEF Enrolment Exchange","Qualcomm Inc.","2017-05-22T05:57:58","Draft","CR",null,"SEC 29"]
["ARC-2017-0174R02","TR-0018_New_Baseline-V2_4_0","Hitachi","2017-05-22T06:14:31","Agreed","CR",null,"ARC 29"]
["MAS-2017-0121","TS-0022_corrections","Qualcomm Inc. (TIA)","2017-05-22T06:14:50","Noted","CR",null,"MAS 29"]
["MAS-2017-0120R01","TS-0006-Management_enablement_(BBF)-V3_3_0-Draft-Baseline","Timothy Carey, Nokia","2017-05-22T08:05:16","Agreed","INC",null,"MAS 29"]
["MAS-2017-0091R01","MAS#29 Agenda","Yongjing Zhang (Huawei, MAS Chair)","2017-05-22T08:23:57","Agreed","AG",null,"MAS 29"]
["MAS-2017-0111","HAIM modification for scanner model","QUALCOMM Inc. (TIA)","2017-05-22T08:29:01","Draft","CR",null,"MAS 29"]
["MAS-2017-0110","HAIM modification for receiver model","QUALCOMM Inc. (TIA)","2017-05-22T09:28:18","Draft","CR",null,"MAS 29"]
["MAS-2017-0095R01","Adding_omaDevice_module _to_TS-0023","NTT","2017-05-22T13:35:56","Draft","CR",null,"MAS 29"]
["ARC-2017-0177R01","Changing Distributed Authorization Resources","Datang","2017-05-22T16:01:56","Draft","CR",null,"ARC 29"]
["ARC-2017-0178R01","Changing Distributed Authorization Resource Procedures","Datang","2017-05-22T16:02:55","Draft","CR",null,"ARC 29"]
["ARC-2017-0179R01","Updating Distributed Authorization Clause11","Datang","2017-05-22T16:04:04","Draft","CR",null,"ARC 29"]
["SEC-2017-0063R01","Distributed authorization resource lifecycle description","Datang","2017-05-22T16:08:24","Draft","CR",null,"SEC 29"]
["SEC-2017-0062R01","Update specification distributed authorization into clause 7","Datang","2017-05-22T16:09:11","Draft","CR",null,"SEC 29"]
["ARC-2017-0180R01","Increasing_the usage_flexibility_of_timeSeries_and_timeSeriesInstance","NTT","2017-05-22T16:41:19","Draft","CR",null,"ARC 29"]
["TP-2017-0117","Update_on_WI_0058_3GPP_&_Cellular_IoT_IWK_0_4_0","Huawei Technologies Co., Ltd.","2017-05-22T23:02:35","Noted","CR",null,"TP 29"]
["ARC-2017-0212R02","schedule synchronization between CSE and RemoteCSE","Huawei Technologies Co., Ltd.","2017-05-23T00:35:00","Draft","CR",null,"ARC 29"]
["ARC-2017-0203R01","TR-0044 Introduction to heterogeneous identification service","Computer Network Information Center, Chinese Academy of Sciences (CNIC)","2017-05-23T00:35:32","Draft","INC",null,"ARC 29"]
["ARC-2017-0206R01","TR-0044 Potential enhancements","Computer Network Information Center, Chinese Academy of Sciences (CNIC)","2017-05-23T00:36:27","Draft","INC",null,"ARC 29"]
["SEC-2017-0064R02","CR TS-0003 R3 PKI SE Framework completion","Gemalto","2017-05-23T01:14:01","Draft","CR",null,"SEC 29"]
["SEC-2017-0074","CR TS-0003 R3 Referencing PKI SE framework","Gemalto","2017-05-23T01:19:39","Draft","CR",null,"SEC 29"]
["SEC-2017-0075","WI-0021 Revised schedule","WI Rapporteur (Gemalto)","2017-05-23T01:28:15","Agreed","INC",null,"SEC 29"]
["SEC-2017-0076","WI-0068 revised schedule","WI Rapporteur (Gemalto)","2017-05-23T01:34:43","Agreed","INC",null,"SEC 29"]
["SEC-2017-0067R04","SEC 29 agenda","WG Chair (Gemalto)","2017-05-23T01:52:14","Draft","AG",null,"SEC 29"]
["TP-2017-0118","oneM2M developer trainings in Korea","KETI","2017-05-23T02:52:14","Draft","INC",null,"TP 29"]
["MAS-2017-0123","Discussion on updating multiple data points in ModuleClasses","Andreas Kraft (Deutsche Telekom), Orange","2017-05-23T02:55:05","Draft","AG",null,"MAS 29"]
["ARC-2017-0226R02","ARC_29_0_Document_Allocation","ARC VC","2017-05-23T02:57:50","Noted","AG",null,"ARC 29"]
["ARC-2017-0175R01","OPC-UA IWK Possible Impacts on oneM2M","Hitachi","2017-05-23T02:58:21","Noted","INC",null,"ARC 29"]
["SEC-2017-0058R01","CR TS-0003 MEF Cert Prov Procedure SCEP","BT plc","2017-05-23T02:59:02","Draft","INC",null,"SEC 29"]
["ARC-2017-0216R02","DDS solution proof material","Huawei Technologies Co., Ltd.","2017-05-23T03:20:23","Draft","INC",null,"ARC 29"]
["MAS-2017-0110R01","HAIM modification for receiver model","QUALCOMM Inc. (TIA)","2017-05-23T03:21:20","Draft","CR",null,"MAS 29"]
["MAS-2017-0114R01","HAIM modification for food prove model","QUALCOMM Inc. (TIA)","2017-05-23T03:21:46","Agreed","CR",null,"MAS 29"]
["MAS-2017-0111R01","HAIM modification for scanner model","QUALCOMM Inc. (TIA)","2017-05-23T03:22:14","Agreed","CR",null,"MAS 29"]
["MAS-2017-0115R01","HAIM modification for set top box model","QUALCOMM Inc. (TIA)","2017-05-23T03:27:19","Noted","CR",null,"MAS 29"]
["MAS-2017-0104R01","HAIM_modification_for_dehumidifier_model","LG Electronics","2017-05-23T03:30:48","Agreed","CR",null,"MAS 29"]
["MAS-2017-0107R01","HAIM_modification_for_printMultiFunction_model","LG Electronics","2017-05-23T03:31:37","Agreed","CR",null,"MAS 29"]
["MAS-2017-0109R01","HAIM_modification_for_TV_model","LG Electronics","2017-05-23T03:33:00","Noted","CR",null,"MAS 29"]
["ARC-2017-0215R01","Solutions for DDS based direct change of data between oneM2M entities","Huawei Technologies Co., Ltd.","2017-05-23T03:43:21","Draft","INC",null,"ARC 29"]
["ARC-2017-0183R01","Modbus_Interworking_Scenarios","ZTE","2017-05-23T03:51:32","Agreed","INC",null,"ARC 29"]
["MAS-2017-0113","HAIM modification for cooktop model","QUALCOMM Inc. (TIA)","2017-05-23T04:03:41","Draft","CR",null,"MAS 29"]
["MAS-2017-0088R01","Adding a new ModuleClass for retrieving and setting movement information","Andreas Kraft (Deutsche Telekom)","2017-05-23T04:07:43","Noted","CR",null,"MAS 29"]
["ARC-2017-0191R01","Semantic Query and Semantic Content","NEC","2017-05-23T05:07:34","Noted","INC",null,"ARC 29"]
["ARC-2017-0192R01","mgmtObj_objectID_attribute","Convida","2017-05-23T05:26:54","Agreed","CR",null,"ARC 29"]
["MAS-2017-0101R01","TS-0014_Updates_for_LWM2M_Interworking_with_mgmtObjects","Convida","2017-05-23T05:28:38","Agreed","CR",null,"MAS 29"]
["MAS-2017-0100R01","Guidelines_for_Mapping_ LWM2M_Objects","Convida","2017-05-23T05:29:18","Agreed","CR",null,"MAS 29"]
["MAS-2017-0123R01","Discussion on updating multiple data points in ModuleClasses","Andreas Kraft (Deutsche Telekom), Orange","2017-05-23T05:59:31","Draft","AG",null,"MAS 29"]
["TP-2017-0120","Introduction to oneM2M Interop4","TST Chair (KETI), Interop Committee","2017-05-23T06:45:45","Draft","INC",null,"TP 29"]
["MAS-2017-0118R03","LwM2M_Event_Log_Mapping","Huawei Technologies Co., Ltd.","2017-05-23T07:24:19","Noted","CR",null,"MAS 29"]
["ARC-2017-0205R01","TR-0044 Use cases analysis","Computer Network Information Center, Chinese Academy of Sciences (CNIC)","2017-05-23T07:52:06","Draft","INC",null,"ARC 29"]
["ARC-2017-0047R02","TS-0026_Background_Data_Transfer","Convida","2017-05-23T08:10:13","Draft","CR",null,"ARC 29"]
["TP-2017-0113R04","Weekly Schedule TP29","Karen Hughes, Secretariat","2017-05-23T08:45:37","Draft","INC",null,"TP 29"]
["TP-2017-0113R05","Weekly Schedule TP29","Karen Hughes, Secretariat","2017-05-23T08:51:01","Draft","INC",null,"TP 29"]
["TP-2017-0122","Reply to LS of ITU-T SG20","Nokia","2017-05-23T08:57:24","Draft","LS",null,"TP 29"]
["MAS-2017-0088R02","Adding a new ModuleClass for retrieving and setting movement information","Andreas Kraft (Deutsche Telekom)","2017-05-23T09:31:23","Draft","CR",null,"MAS 29"]
["ARC-2017-0197R01","Modbus_Interworking_solutions","ZTE","2017-05-23T09:31:49","Noted","INC",null,"ARC 29"]
["ARC-2017-0194R01","TR-0020_transaction_management_solution","Convida","2017-05-23T09:40:07","Draft","CR",null,"ARC 29"]
["MAS-2017-0121R01","TS-0022_corrections","Qualcomm Inc. (TIA)","2017-05-23T10:41:23","Draft","CR",null,"MAS 29"]
["TP-2017-0113R06","Weekly Schedule TP29","Karen Hughes, Secretariat","2017-05-23T14:27:17","Draft","INC",null,"TP 29"]
["MAS-2017-0092R02","MAS#29 Doc allocation","Yongjing Zhang (Huawei, MAS Chair)","2017-05-23T14:48:23","Draft","AG",null,"MAS 29"]
["MAS-2017-0092R03","MAS#29 Doc allocation","Yongjing Zhang (Huawei, MAS Chair)","2017-05-23T14:48:41","Draft","AG",null,"MAS 29"]
["TP-2017-0123","WI-0021 Schedule Update","WI Rapporteur (Gemalto)","2017-05-23T23:12:38","Approved","INC",null,"TP 29"]
["TP-2017-0124","WI-0068 Schedule Update","WI Rapporteur (Gemalto)","2017-05-23T23:27:28","Approved","INC",null,"TP 29"]
["MAS-2017-0124","TR-0046 DASE case study","SyncTechno, KETI","2017-05-24T02:34:11","Draft","INC",null,"MAS 29"]
["TP-2017-0125","WI-0064 smart city - update","KETI","2017-05-24T03:54:03","Draft","CR",null,"TP 29"]
["TP-2017-0110R02","LS_to_OMA-DM_on_EventLog_LwM2M_Objects","Huawei Technologies Co., Ltd.","2017-05-24T05:49:53","Draft","LS",null,"TP 29"]
["TP-2017-0125R01","WI-0064 smart city - update","KETI","2017-05-24T07:27:06","Noted","CR",null,"TP 29"]
["TP-2017-0112R01","Agenda TP29","Omar Elloumi, TP Chair","2017-05-24T08:27:45","Agreed","AG",null,"TP 29"]
["MAS-2017-0118R04","LwM2M_Event_Log_Mapping","Huawei Technologies Co., Ltd.","2017-05-24T10:16:37","Draft","CR",null,"MAS 29"]
["MAS-2017-0094R01","WoT Interworking Background for TR-0042","Convida, Huawei","2017-05-24T11:29:02","Draft","CR",null,"MAS 29"]
["ARC-2017-0211R02","TR-0024-UE Location Reporting Solution","Huawei Technologies Co., Ltd.","2017-05-24T16:02:29","Draft","CR",null,"ARC 29"]
["MAS-2017-0121R02","TS-0022_corrections","Qualcomm Inc. (TIA)","2017-05-24T16:03:23","Draft","CR",null,"MAS 29"]
["ARC-2017-0177R02","Changing Distributed Authorization Resources","Datang","2017-05-24T16:32:57","Draft","CR",null,"ARC 29"]
["MAS-2017-0117R01","New type definitions for Generic Interworking","NEC","2017-05-24T16:38:59","Draft","INC",null,"MAS 29"]
["ARC-2017-0195R01","Proximal_IoT_Interworking_solution_discussion","Huawei Technologies Co., Ltd.","2017-05-24T17:21:30","Draft","INC",null,"ARC 29"]
["ARC-2017-0228","ResourceNameRestriction_R3","Convida","2017-05-24T23:29:59","Draft","CR",null,"ARC 29"]
["ARC-2017-0184R01","StorageBasedEventClarification_R3","Convida","2017-05-24T23:31:33","Draft","CR",null,"ARC 29"]
["ARC-2017-0185R01","GroupTimeOutForAggregatingNotifications_R3","Convida","2017-05-24T23:38:46","Draft","CR",null,"ARC 29"]
["ARC-2017-0212R03","schedule synchronization between CSE and RemoteCSE","Huawei Technologies Co., Ltd.","2017-05-25T00:13:41","Draft","CR",null,"ARC 29"]
["ARC-2017-0227R01","TS-0001-schedule_updating_for_MonitoringEvent(UE_Reachability)","Huawei Technologies Co., Ltd.","2017-05-25T00:15:09","Draft","CR",null,"ARC 29"]
["ARC-2017-0210R02","MonitoringEvent(UE Reachability)","Huawei Technologies Co., Ltd.","2017-05-25T00:16:26","Draft","CR",null,"ARC 29"]
["MAS-2017-0115R02","HAIM modification for set top box model","QUALCOMM Inc. (TIA)","2017-05-25T02:46:19","Draft","CR",null,"MAS 29"]
["MAS-2017-0110R02","HAIM modification for receiver model","QUALCOMM Inc. (TIA)","2017-05-25T02:55:45","Draft","CR",null,"MAS 29"]
["MAS-2017-0109R02","HAIM_modification_for_TV_model","LG Electronics","2017-05-25T03:02:43","Draft","CR",null,"MAS 29"]
["MAS-2017-0109R03","HAIM_modification_for_TV_model","LG Electronics","2017-05-25T03:41:21","Draft","CR",null,"MAS 29"]
["MAS-2017-0095R02","Adding_omaDevice_module _to_TS-0023","NTT","2017-05-25T05:31:01","Draft","CR",null,"MAS 29"]
["MAS-2017-0088R03","Adding a new ModuleClass for retrieving and setting movement information","Andreas Kraft (Deutsche Telekom)","2017-05-25T05:38:14","Draft","CR",null,"MAS 29"]
["MAS-2017-0121R03","TS-0022_corrections","Qualcomm Inc. (TIA)","2017-05-25T05:43:59","Draft","CR",null,"MAS 29"]
["MAS-2017-0094R02","WoT Interworking Background for TR-0042","Convida, Huawei","2017-05-25T06:02:56","Draft","CR",null,"MAS 29"]
["MAS-2017-0121R04","TS-0022_corrections","Qualcomm Inc. (TIA)","2017-05-25T06:04:58","Draft","CR",null,"MAS 29"]
["MAS-2017-0113R01","HAIM modification for cooktop model","QUALCOMM Inc. (TIA)","2017-05-25T06:11:04","Draft","CR",null,"MAS 29"]
["MAS-2017-0110R03","HAIM modification for receiver model","QUALCOMM Inc. (TIA)","2017-05-25T06:22:34","Draft","CR",null,"MAS 29"]
["MAS-2017-0096R01","Semantic Mashup for TS-0034","Convida","2017-05-25T06:45:12","Draft","CR",null,"MAS 29"]
["MAS-2017-0124R01","TR-0046 DASE case study","SyncTechno, KETI","2017-05-25T06:57:59","Draft","INC",null,"MAS 29"]
["TP-2017-0121","Work_Item_Status_%comp_TP29","Roland Hechwartner, WPM convenor",null,"Draft","STR",null,"TP 29"]
["TP-2017-0119","WPM status report TP29","Roland Hechwartner, WPM convenor",null,"Draft","STR",null,"TP 29"]
["REQ-2017-0034","TR-0026 requirment matrix for CR tracking","Convida",null,"Draft","INC",null,"REQ 29"]
["REQ-2017-0033","TS-0002 updates based on TR-0026 requirements","Convida",null,"Draft","CR",null,"REQ 29"]
["SEC-2017-0073","SEC29_Minutes","Victoria Mitchell, Secretariat",null,"Draft","MIN",null,"SEC 29"]
["SEC-2017-0072","CR TS-0003 CSR Attributes","Qualcomm Inc.",null,"Draft","CR",null,"SEC 29"]
["SEC-2017-0071","CR_TS-0003_R2_clause_12","Qualcomm Inc. (TIA)",null,"Draft","CR",null,"SEC 29"]
["MAS-2017-0122","MAS29_Minutes","Victoria Mitchell, Secretariat",null,"Draft","MIN",null,"MAS 29"]
["MAS-2017-0112","HAIM modification for cookerHood model","QUALCOMM Inc. (TIA)",null,"Draft","CR",null,"MAS 29"]
["MAS-2017-0105","HAIM modification for camera model","QUALCOMM Inc. (TIA)",null,"Draft","CR",null,"MAS 29"]

{"sheet":"TP","index":3,"n_rows":37,"n_cols":8,"rows_kept":37,"cut":false,"hidden":false,"merged":[]}
["SHORT DOC NB","SHORTNAME","SOURCE","UPLOADED","STATUS","DOC TYPE","VERS","MEETING"]
["TP-2017-0054","Invitation_to_TP29_Shenzhen_China","CCSA","2017-02-24T08:05:07","Noted","INV",null,"TP 29"]
["TP-2017-0101","Reply LS to GSMA Mobile IoT response to oneM2M","3GPP SA2","2017-04-04T12:41:03","Noted","LS",null,"TP 29"]
["TP-2017-0102","ETSI ISG MEC (Multi access Edge Computing) Phase 2","ETSI ISG MEC","2017-04-06T12:53:39","Noted","LS",null,"TP 29"]
["TP-2017-0103","LS on the new structure of ITU-T SG20","ITU-T SG20","2017-04-10T08:30:51","Noted","LS",null,"TP 29"]
["TP-2017-0106","Voting List for TP29","Karen Hughes, Secretariat","2017-04-19T14:10:19","Noted","INC",null,"TP 29"]
["TP-2017-0106R01","Voting List for TP29","Karen Hughes, Secretariat","2017-04-20T06:22:55","Approved","INC",null,"TP 29"]
["TP-2017-0108","Work Program Status TP#29 opening","Roland Hechwartner, WPM convenor","2017-05-12T13:50:33","Noted","STR",null,"TP 29"]
["TP-2017-0109","Release 3 Summary","TP VC / ARC VC","2017-05-12T19:47:09","Noted","INC",null,"TP 29"]
["TP-2017-0110","LS_to_OMA-DM_on_EventLog_LwM2M_Objects","Huawei Technologies Co., Ltd.","2017-05-15T08:30:13","Noted","LS",null,"TP 29"]
["TP-2017-0062R02","Newbies Session","Roland Hechwartner, Deutsche Telekom","2017-05-15T13:39:34","Draft","INC",null,"TP 29"]
["TP-2017-0111","Update_on_WI_0048_OSGi_Interworking","Huawei Technologies Co., Ltd.","2017-05-17T03:20:00","Noted","INC",null,"TP 29"]
["TP-2017-0113","Weekly Schedule TP29","Karen Hughes, Secretariat","2017-05-18T08:17:47","Noted","INC",null,"TP 29"]
["TP-2017-0113R01","Weekly Schedule TP29","Karen Hughes, Secretariat","2017-05-18T13:19:17","Noted","INC",null,"TP 29"]
["TP-2017-0114","KEPCO_e-IoT_deployment","KEPCO, ETRI","2017-05-18T23:15:03","Draft","INC",null,"TP 29"]
["TP-2017-0115","ARC_28_Interim_CR_Pack_TS-0001","ARC Vice Chair","2017-05-19T15:15:59","Agreed","INC",null,"TP 29"]
["TP-2017-0116","IETF Workshop on IoT Semantic/Hypermedia Interoperability","Timothy Carey, Nokia","2017-05-20T04:02:52","Noted","INC",null,"TP 29"]
["TP-2017-0110R01","LS_to_OMA-DM_on_EventLog_LwM2M_Objects","Huawei Technologies Co., Ltd.","2017-05-20T10:51:59","Noted","LS",null,"TP 29"]
["TP-2017-0112","Agenda TP29","Omar Elloumi, TP Chair","2017-05-21T06:29:05","Agreed","AG",null,"TP 29"]
["TP-2017-0113R02","Weekly Schedule TP29","Karen Hughes, Secretariat","2017-05-21T06:33:35","Noted","INC",null,"TP 29"]
["TP-2017-0113R03","Weekly Schedule TP29","Karen Hughes, Secretariat","2017-05-21T08:50:59","Noted","INC",null,"TP 29"]
["TP-2017-0111R01","Update_on_WI_0048_OSGi_Interworking","Huawei Technologies Co., Ltd.","2017-05-22T01:01:24","Noted","INC",null,"TP 29"]
["TP-2017-0117","Update_on_WI_0058_3GPP_&_Cellular_IoT_IWK_0_4_0","Huawei Technologies Co., Ltd.","2017-05-22T23:02:35","Noted","CR",null,"TP 29"]
["TP-2017-0118","oneM2M developer trainings in Korea","KETI","2017-05-23T02:52:14","Draft","INC",null,"TP 29"]
["TP-2017-0120","Introduction to oneM2M Interop4","TST Chair (KETI), Interop Committee","2017-05-23T06:45:45","Draft","INC",null,"TP 29"]
["TP-2017-0113R04","Weekly Schedule TP29","Karen Hughes, Secretariat","2017-05-23T08:45:37","Draft","INC",null,"TP 29"]
["TP-2017-0113R05","Weekly Schedule TP29","Karen Hughes, Secretariat","2017-05-23T08:51:01","Draft","INC",null,"TP 29"]
["TP-2017-0122","Reply to LS of ITU-T SG20","Nokia","2017-05-23T08:57:24","Draft","LS",null,"TP 29"]
["TP-2017-0113R06","Weekly Schedule TP29","Karen Hughes, Secretariat","2017-05-23T14:27:17","Draft","INC",null,"TP 29"]
["TP-2017-0123","WI-0021 Schedule Update","WI Rapporteur (Gemalto)","2017-05-23T23:12:38","Approved","INC",null,"TP 29"]
["TP-2017-0124","WI-0068 Schedule Update","WI Rapporteur (Gemalto)","2017-05-23T23:27:28","Approved","INC",null,"TP 29"]
["TP-2017-0125","WI-0064 smart city - update","KETI","2017-05-24T03:54:03","Draft","CR",null,"TP 29"]
["TP-2017-0110R02","LS_to_OMA-DM_on_EventLog_LwM2M_Objects","Huawei Technologies Co., Ltd.","2017-05-24T05:49:53","Draft","LS",null,"TP 29"]
["TP-2017-0125R01","WI-0064 smart city - update","KETI","2017-05-24T07:27:06","Noted","CR",null,"TP 29"]
["TP-2017-0112R01","Agenda TP29","Omar Elloumi, TP Chair","2017-05-24T08:27:45","Agreed","AG",null,"TP 29"]
["TP-2017-0121","Work_Item_Status_%comp_TP29","Roland Hechwartner, WPM convenor",null,"Draft","STR",null,"TP 29"]
["TP-2017-0119","WPM status report TP29","Roland Hechwartner, WPM convenor",null,"Draft","STR",null,"TP 29"]

{"sheet":"REQ","index":4,"n_rows":7,"n_cols":8,"rows_kept":7,"cut":false,"hidden":false,"merged":[]}
["SHORT DOC NB","SHORTNAME","SOURCE","UPLOADED","STATUS","DOC TYPE","VERS","MEETING"]
["REQ-2017-0029R01","Draft-TR-0026-Vehicular_Domain_Enablement_v_0_8_0","KDDI, Huawei Technologies, LG Electronics","2017-04-06T00:50:19","Agreed","CR",null,"REQ 29"]
["REQ-2017-0030","TR026 to TS002 new reqs already implemented","Convida","2017-04-10T17:29:43","Draft","CR",null,"REQ 29"]
["REQ-2017-0031","TR026 to TS002 new reqs not implemented","Convida","2017-04-10T17:29:56","Draft","CR",null,"REQ 29"]
["REQ-2017-0032","Draft-TR-0026-Vehicular_Domain_Enablement_v_0_8_1","KDDI, Huawei Technologies, LG Electronics","2017-04-26T13:16:27","Agreed","CR",null,"REQ 29"]
["REQ-2017-0034","TR-0026 requirment matrix for CR tracking","Convida",null,"Draft","INC",null,"REQ 29"]
["REQ-2017-0033","TS-0002 updates based on TR-0026 requirements","Convida",null,"Draft","CR",null,"REQ 29"]

{"sheet":"ARC","index":5,"n_rows":95,"n_cols":8,"rows_kept":95,"cut":false,"hidden":false,"merged":[]}
["SHORT DOC NB","SHORTNAME","SOURCE","UPLOADED","STATUS","DOC TYPE","VERS","MEETING"]
["ARC-2017-0149","TR-0020 0.7.0 new baseline","Huawei Technologies Co., Ltd.","2017-04-01T13:54:07","Agreed","INC",null,"ARC 29"]
["ARC-2017-0174","TR-0018_New_Baseline","Hitachi","2017-05-12T01:32:09","Noted","CR",null,"ARC 29"]
["ARC-2017-0175","OPC-UA IWK Possible Impacts on oneM2M","Hitachi","2017-05-12T01:35:53","Noted","INC",null,"ARC 29"]
["ARC-2017-0176","Identifier_expression_in_common_attribute","NTT","2017-05-12T03:56:19","Draft","INC",null,"ARC 29"]
["ARC-2017-0177","Changing Distributed Authorization Resources","Datang","2017-05-12T07:27:20","Draft","CR",null,"ARC 29"]
["ARC-2017-0178","Changing Distributed Authorization Resource Procedures","Datang","2017-05-12T07:32:56","Draft","CR",null,"ARC 29"]
["ARC-2017-0179","Updating Distributed Authorization Clause11","Datang","2017-05-12T07:36:20","Draft","CR",null,"ARC 29"]
["ARC-2017-0180","Increasing_the usage_flexibility_of_timeSeries_and_timeSeriesInstance","NTT","2017-05-12T09:00:46","Noted","CR",null,"ARC 29"]
["ARC-2017-0181","Adding_common_attributes_for_interworking","NTT","2017-05-12T09:05:32","Draft","CR",null,"ARC 29"]
["ARC-2017-0182","Operation_Execution_Time_update","ZTE","2017-05-12T09:07:37","Noted","CR",null,"ARC 29"]
["ARC-2017-0183","Modbus_Interworking_Scenarios","ZTE","2017-05-12T09:14:01","Noted","INC",null,"ARC 29"]
["ARC-2017-0191","Semantic Query and Semantic Content","NEC","2017-05-12T17:15:01","Draft","INC",null,"ARC 29"]
["ARC-2017-0192","mgmtObj_objectID_attribute","Convida","2017-05-12T18:45:03","Draft","CR",null,"ARC 29"]
["ARC-2017-0193","Service_Enabled_AE","Convida","2017-05-12T18:56:23","Noted","CR",null,"ARC 29"]
["ARC-2017-0194","TR-0020_transaction_management_solution","Convida","2017-05-12T20:00:42","Noted","CR",null,"ARC 29"]
["ARC-2017-0115R03","Resource Type group Rel-3","KT","2017-05-14T11:01:50","Noted","CR",null,"ARC 29"]
["ARC-2017-0195","Proximal_IoT_Interworking_solution_discussion","Huawei Technologies Co., Ltd.","2017-05-14T15:01:25","Draft","INC",null,"ARC 29"]
["ARC-2017-0196","OSGi_oneM2M_service_mapping","Huawei Technologies Co., Ltd.","2017-05-14T15:02:44","Noted","INC",null,"ARC 29"]
["ARC-2017-0197","Modbus_Interworking_solutions","ZTE","2017-05-14T15:15:24","Noted","INC",null,"ARC 29"]
["ARC-2017-0047R01","TS-0026_Background_Data_Transfer","Convida","2017-05-14T21:01:21","Noted","CR",null,"ARC 29"]
["ARC-2017-0198","BDT approaches discussion","Convida","2017-05-14T21:01:40","Noted","INC",null,"ARC 29"]
["ARC-2017-0199","TR-0026 time sync key issue","Convida","2017-05-14T21:01:57","Draft","CR",null,"ARC 29"]
["ARC-2017-0200","TS-0001 maintaining AE contact solution from TR-0026","Convida","2017-05-14T21:02:18","Draft","CR",null,"ARC 29"]
["ARC-2017-0201","TS-0001 filtering clarifications and enhancements","Convida","2017-05-14T21:03:09","Draft","CR",null,"ARC 29"]
["ARC-2017-0202","contentInstance immutability discussion","Convida","2017-05-14T21:03:27","Draft","AG",null,"ARC 29"]
["ARC-2017-0203","TR-0044 Introduction to heterogeneous identification service","Computer Network Information Center, Chinese Academy of Sciences (CNIC)","2017-05-14T22:02:25","Draft","INC",null,"ARC 29"]
["ARC-2017-0204","TR-0044 Existing technologies","Computer Network Information Center, Chinese Academy of Sciences (CNIC)","2017-05-14T22:08:29","Draft","INC",null,"ARC 29"]
["ARC-2017-0205","TR-0044 Use cases analysis","Computer Network Information Center, Chinese Academy of Sciences (CNIC)","2017-05-14T22:11:56","Draft","INC",null,"ARC 29"]
["ARC-2017-0206","TR-0044 Potential enhancements","Computer Network Information Center, Chinese Academy of Sciences (CNIC)","2017-05-14T22:14:53","Draft","INC",null,"ARC 29"]
["ARC-2017-0184","StorageBasedEventClarification_R3","Convida","2017-05-15T00:26:12","Noted","CR",null,"ARC 29"]
["ARC-2017-0185","GroupTimeOutForAggregatingNotifications_R3","Convida","2017-05-15T00:26:49","Draft","CR",null,"ARC 29"]
["ARC-2017-0186","ContainerDeleteDNSTypo_R3","Convida","2017-05-15T00:27:21","Draft","CR",null,"ARC 29"]
["ARC-2017-0187","ContainerDeleteDNSTypo_R2","Convida","2017-05-15T00:27:51","Draft","CR",null,"ARC 29"]
["ARC-2017-0188","CollectedEntityIDAttributeTypeChange_R3","Convida","2017-05-15T00:28:27","Draft","CR",null,"ARC 29"]
["ARC-2017-0189","CollectedEntityIDAttributeTypeChange_R2","Convida","2017-05-15T00:29:17","Draft","CR",null,"ARC 29"]
["ARC-2017-0190","ContentSerialization_R3","Convida","2017-05-15T00:29:55","Draft","CR",null,"ARC 29"]
["ARC-2017-0188R01","CollectedEntityIDAttributeTypeChange_R3","Convida","2017-05-15T00:35:31","Draft","CR",null,"ARC 29"]
["ARC-2017-0207","adding condition tags equality cases","BOE","2017-05-15T01:52:24","Draft","CR",null,"ARC 29"]
["ARC-2017-0208","adding condition tags equality cases mirror R1","BOE","2017-05-15T01:57:16","Draft","CR",null,"ARC 29"]
["ARC-2017-0209","adding condition tags equality cases mirror R2","BOE","2017-05-15T01:58:38","Draft","CR",null,"ARC 29"]
["ARC-2017-0214","MulticastGroupCreationEditableUpdate","Huawei Technologies Co., Ltd.","2017-05-15T08:47:45","Draft","CR",null,"ARC 29"]
["ARC-2017-0213","MulticastGroupFanoutEditableUpdate","Huawei Technologies Co., Ltd.","2017-05-15T08:48:29","Draft","CR",null,"ARC 29"]
["ARC-2017-0212","schedule synchronization between CSE and RemoteCSE","Huawei Technologies Co., Ltd.","2017-05-15T08:51:02","Draft","CR",null,"ARC 29"]
["ARC-2017-0211","TR-0024-UE Location Reporting Solution","Huawei Technologies Co., Ltd.","2017-05-15T08:51:35","Draft","CR",null,"ARC 29"]
["ARC-2017-0210","MonitoringEvent(UE Reachability)","Huawei Technologies Co., Ltd.","2017-05-15T08:51:59","Noted","CR",null,"ARC 29"]
["ARC-2017-0215","Solutions for DDS based direct change of data between oneM2M entities","Huawei Technologies Co., Ltd.","2017-05-15T09:18:55","Draft","INC",null,"ARC 29"]
["ARC-2017-0216","DDS solution proof material","Huawei Technologies Co., Ltd.","2017-05-15T09:49:59","Draft","INC",null,"ARC 29"]
["ARC-2017-0217","Device representation in oneM2M","Huawei Technologies Co., Ltd.","2017-05-15T11:50:28","Draft","INC",null,"ARC 29"]
["ARC-2017-0217R01","Device representation in oneM2M","Huawei Technologies Co., Ltd.","2017-05-16T08:42:51","Draft","INC",null,"ARC 29"]
["ARC-2017-0218","OSGi_oneM2M_service_mapping","Huawei Technologies Co., Ltd.","2017-05-17T03:18:09","Draft","INC",null,"ARC 29"]
["ARC-2017-0219","Update on oneM2M features","Huawei Technologies Co., Ltd.","2017-05-18T07:04:06","Draft","INC",null,"ARC 29"]
["ARC-2017-0221","non-blocking cleanup (rel-2)","KETI","2017-05-18T09:40:27","Draft","INC",null,"ARC 29"]
["ARC-2017-0222","originator context info of ACP (rel-2)","KETI","2017-05-18T09:40:49","Noted","INC",null,"ARC 29"]
["ARC-2017-0224","key value pair query","Huawei Technologies Co., Ltd.","2017-05-18T11:43:05","Draft","CR",null,"ARC 29"]
["ARC-2017-0220","discussions on AE registration","KETI","2017-05-18T14:41:13","Draft","INC",null,"ARC 29"]
["ARC-2017-0218R01","OSGi_oneM2M_service_mapping","Huawei Technologies Co., Ltd.","2017-05-19T02:52:54","Draft","INC",null,"ARC 29"]
["ARC-2017-0223","TR-0026 new solution for cross-resource subscription","KETI","2017-05-19T03:01:56","Draft","INC",null,"ARC 29"]
["ARC-2017-0225","ARC_29_0_Agenda","ARC VC","2017-05-19T14:58:33","Draft","AG",null,"ARC 29"]
["ARC-2017-0226","ARC_29_0_Document_Allocation","ARC VC","2017-05-19T14:58:55","Noted","AG",null,"ARC 29"]
["ARC-2017-0227","TS-0001-schedule_updating_for_MonitoringEvent(UE_Reachability)","Huawei Technologies Co., Ltd.","2017-05-20T08:05:57","Draft","CR",null,"ARC 29"]
["ARC-2017-0210R01","MonitoringEvent(UE Reachability)","Huawei Technologies Co., Ltd.","2017-05-20T08:28:26","Draft","CR",null,"ARC 29"]
["ARC-2017-0211R01","TR-0024-UE Location Reporting Solution","Huawei Technologies Co., Ltd.","2017-05-20T08:30:16","Noted","CR",null,"ARC 29"]
["ARC-2017-0212R01","schedule synchronization between CSE and RemoteCSE","Huawei Technologies Co., Ltd.","2017-05-20T08:30:46","Noted","CR",null,"ARC 29"]
["ARC-2017-0216R01","DDS solution proof material","Huawei Technologies Co., Ltd.","2017-05-20T09:42:09","Draft","INC",null,"ARC 29"]
["ARC-2017-0226R01","ARC_29_0_Document_Allocation","ARC VC","2017-05-21T15:41:09","Noted","AG",null,"ARC 29"]
["ARC-2017-0174R01","TR-0018_New_Baseline-V2_4_0","Hitachi","2017-05-22T01:03:37","Noted","CR",null,"ARC 29"]
["ARC-2017-0174R02","TR-0018_New_Baseline-V2_4_0","Hitachi","2017-05-22T06:14:31","Agreed","CR",null,"ARC 29"]
["ARC-2017-0177R01","Changing Distributed Authorization Resources","Datang","2017-05-22T16:01:56","Draft","CR",null,"ARC 29"]
["ARC-2017-0178R01","Changing Distributed Authorization Resource Procedures","Datang","2017-05-22T16:02:55","Draft","CR",null,"ARC 29"]
["ARC-2017-0179R01","Updating Distributed Authorization Clause11","Datang","2017-05-22T16:04:04","Draft","CR",null,"ARC 29"]
["ARC-2017-0180R01","Increasing_the usage_flexibility_of_timeSeries_and_timeSeriesInstance","NTT","2017-05-22T16:41:19","Draft","CR",null,"ARC 29"]
["ARC-2017-0212R02","schedule synchronization between CSE and RemoteCSE","Huawei Technologies Co., Ltd.","2017-05-23T00:35:00","Draft","CR",null,"ARC 29"]
["ARC-2017-0203R01","TR-0044 Introduction to heterogeneous identification service","Computer Network Information Center, Chinese Academy of Sciences (CNIC)","2017-05-23T00:35:32","Draft","INC",null,"ARC 29"]
["ARC-2017-0206R01","TR-0044 Potential enhancements","Computer Network Information Center, Chinese Academy of Sciences (CNIC)","2017-05-23T00:36:27","Draft","INC",null,"ARC 29"]
["ARC-2017-0226R02","ARC_29_0_Document_Allocation","ARC VC","2017-05-23T02:57:50","Noted","AG",null,"ARC 29"]
["ARC-2017-0175R01","OPC-UA IWK Possible Impacts on oneM2M","Hitachi","2017-05-23T02:58:21","Noted","INC",null,"ARC 29"]
["ARC-2017-0216R02","DDS solution proof material","Huawei Technologies Co., Ltd.","2017-05-23T03:20:23","Draft","INC",null,"ARC 29"]
["ARC-2017-0215R01","Solutions for DDS based direct change of data between oneM2M entities","Huawei Technologies Co., Ltd.","2017-05-23T03:43:21","Draft","INC",null,"ARC 29"]
["ARC-2017-0183R01","Modbus_Interworking_Scenarios","ZTE","2017-05-23T03:51:32","Agreed","INC",null,"ARC 29"]
["ARC-2017-0191R01","Semantic Query and Semantic Content","NEC","2017-05-23T05:07:34","Noted","INC",null,"ARC 29"]
["ARC-2017-0192R01","mgmtObj_objectID_attribute","Convida","2017-05-23T05:26:54","Agreed","CR",null,"ARC 29"]
["ARC-2017-0205R01","TR-0044 Use cases analysis","Computer Network Information Center, Chinese Academy of Sciences (CNIC)","2017-05-23T07:52:06","Draft","INC",null,"ARC 29"]
["ARC-2017-0047R02","TS-0026_Background_Data_Transfer","Convida","2017-05-23T08:10:13","Draft","CR",null,"ARC 29"]
["ARC-2017-0197R01","Modbus_Interworking_solutions","ZTE","2017-05-23T09:31:49","Noted","INC",null,"ARC 29"]
["ARC-2017-0194R01","TR-0020_transaction_management_solution","Convida","2017-05-23T09:40:07","Draft","CR",null,"ARC 29"]
["ARC-2017-0211R02","TR-0024-UE Location Reporting Solution","Huawei Technologies Co., Ltd.","2017-05-24T16:02:29","Draft","CR",null,"ARC 29"]
["ARC-2017-0177R02","Changing Distributed Authorization Resources","Datang","2017-05-24T16:32:57","Draft","CR",null,"ARC 29"]
["ARC-2017-0195R01","Proximal_IoT_Interworking_solution_discussion","Huawei Technologies Co., Ltd.","2017-05-24T17:21:30","Draft","INC",null,"ARC 29"]
["ARC-2017-0228","ResourceNameRestriction_R3","Convida","2017-05-24T23:29:59","Draft","CR",null,"ARC 29"]
["ARC-2017-0184R01","StorageBasedEventClarification_R3","Convida","2017-05-24T23:31:33","Draft","CR",null,"ARC 29"]
["ARC-2017-0185R01","GroupTimeOutForAggregatingNotifications_R3","Convida","2017-05-24T23:38:46","Draft","CR",null,"ARC 29"]
["ARC-2017-0212R03","schedule synchronization between CSE and RemoteCSE","Huawei Technologies Co., Ltd.","2017-05-25T00:13:41","Draft","CR",null,"ARC 29"]
["ARC-2017-0227R01","TS-0001-schedule_updating_for_MonitoringEvent(UE_Reachability)","Huawei Technologies Co., Ltd.","2017-05-25T00:15:09","Draft","CR",null,"ARC 29"]
["ARC-2017-0210R02","MonitoringEvent(UE Reachability)","Huawei Technologies Co., Ltd.","2017-05-25T00:16:26","Draft","CR",null,"ARC 29"]

{"sheet":"PRO","index":6,"n_rows":26,"n_cols":8,"rows_kept":26,"cut":false,"hidden":false,"merged":[]}
["SHORT DOC NB","SHORTNAME","SOURCE","UPLOADED","STATUS","DOC TYPE","VERS","MEETING"]
["PRO-2017-0092","Updated reference for CoAP on Rel-1","KT","2017-05-12T01:23:59","Draft","CR",null,"PRO 29"]
["PRO-2017-0093","Updated reference for CoAP on Rel-2","KT","2017-05-12T01:27:38","Draft","CR",null,"PRO 29"]
["PRO-2017-0094","MQTT server co-located within a node on Rel-1","KT","2017-05-12T01:50:07","Draft","CR",null,"PRO 29"]
["PRO-2017-0095","MQTT server co-located within a node on Rel-2","KT","2017-05-12T01:51:53","Draft","CR",null,"PRO 29"]
["PRO-2017-0096","MQTT server located independently from nodes on Rel-1","KT","2017-05-12T02:05:54","Draft","CR",null,"PRO 29"]
["PRO-2017-0097","MQTT server located independently from nodes on Rel-2","KT","2017-05-12T02:08:22","Draft","CR",null,"PRO 29"]
["PRO-2017-0098","Connecting to MQTT on Rel-1","KT","2017-05-12T02:23:58","Draft","CR",null,"PRO 29"]
["PRO-2017-0099","Connecting to MQTT on Rel-2","KT","2017-05-12T02:26:16","Draft","CR",null,"PRO 29"]
["PRO-2017-0100","MQTT Request and Response Messages on Rel-1","KT","2017-05-12T04:23:20","Draft","CR",null,"PRO 29"]
["PRO-2017-0101","MQTT Request and Response Messages on Rel-2","KT","2017-05-12T04:25:06","Draft","CR",null,"PRO 29"]
["PRO-2017-0102","MQTT Sending a Request on Rel-1","KT","2017-05-12T04:37:51","Draft","CR",null,"PRO 29"]
["PRO-2017-0103","MQTT Sending a Request on Rel-2","KT","2017-05-12T04:41:35","Draft","CR",null,"PRO 29"]
["PRO-2017-0104","Listening for and responding to a Request on Rel-1","KT","2017-05-12T04:47:08","Draft","CR",null,"PRO 29"]
["PRO-2017-0105","Listening for and responding to a Request on Rel-2","KT","2017-05-12T04:49:36","Draft","CR",null,"PRO 29"]
["PRO-2017-0106","MQTT Request/Response Message Flow on Rel-1","KT","2017-05-12T05:02:18","Draft","CR",null,"PRO 29"]
["PRO-2017-0106R01","MQTT Request/Response Message Flow on Rel-1","KT","2017-05-12T05:08:39","Draft","CR",null,"PRO 29"]
["PRO-2017-0107","MQTT Request/Response Message Flow on Rel-2","KT","2017-05-12T05:13:08","Draft","CR",null,"PRO 29"]
["PRO-2017-0060R02","Resource Type group Rel-3","KT","2017-05-12T05:22:26","Draft","CR",null,"PRO 29"]
["PRO-2017-0108","Distributed Authorization R3","Datang","2017-05-12T08:26:09","Draft","CR",null,"PRO 29"]
["PRO-2017-0111","XSD_descriptorRepresentation_correction_R2","Qualcomm Inc. (TIA)","2017-05-14T21:28:00","Draft","CR",null,"PRO 29"]
["PRO-2017-0110","XSD_descriptorRepresentation_correction_R3","Qualcomm Inc. (TIA)","2017-05-14T21:28:17","Draft","CR",null,"PRO 29"]
["PRO-2017-0109","ContentSerialization_R3","Convida","2017-05-15T00:36:35","Draft","CR",null,"PRO 29"]
["PRO-2017-0112","Correction_of_Resource_handling_procedure_of_Receiver_for_flexBlocking(R1)","KT","2017-05-15T06:05:59","Draft","CR",null,"PRO 29"]
["PRO-2017-0113","Correction_of_Resource_handling_procedure_of_Receiver_for_flexBlocking(R2)","KT","2017-05-15T06:07:55","Draft","CR",null,"PRO 29"]
["PRO-2017-0114","Correction_of_Resource_handling_procedure_of_Receiver_for_flexBlocking(R3)_mirror","KT","2017-05-15T06:09:14","Draft","CR",null,"PRO 29"]

{"sheet":"SEC","index":7,"n_rows":27,"n_cols":8,"rows_kept":27,"cut":false,"hidden":false,"merged":[]}
["SHORT DOC NB","SHORTNAME","SOURCE","UPLOADED","STATUS","DOC TYPE","VERS","MEETING"]
["SEC-2017-0062","Update specification distributed authorization into clause 7","Datang","2017-05-12T07:11:27","Draft","CR",null,"SEC 29"]
["SEC-2017-0063","Distributed authorization resource lifecycle description","Datang","2017-05-12T07:14:04","Draft","CR",null,"SEC 29"]
["SEC-2017-0064","CR TS-0003 R3 PKI SE Framework completion","Gemalto","2017-05-12T16:13:06","Draft","CR",null,"SEC 29"]
["SEC-2017-0065","CR TR-0041 Algorithm details","Huawei","2017-05-14T12:43:12","Draft","CR",null,"SEC 29"]
["SEC-2017-0061R02","CR_TS-0003_R2_Correction_to_Access_Control_mechanism","Qualcomm Inc. (TIA)","2017-05-14T20:19:45","Noted","CR",null,"SEC 29"]
["SEC-2017-0066","TS-0032_addressing_editors_notes","Qualcomm Inc. (TIA)","2017-05-14T20:52:32","Draft","INC",null,"SEC 29"]
["SEC-2017-0064R01","CR TS-0003 R3 PKI SE Framework completion","Gemalto","2017-05-15T14:38:14","Noted","CR",null,"SEC 29"]
["SEC-2017-0068","Overview_on_Decentralized_Authentication","Huawei","2017-05-16T07:48:29","Draft","INC",null,"SEC 29"]
["SEC-2017-0067","SEC 29 agenda","WG Chair (Gemalto)","2017-05-18T11:16:02","Draft","AG",null,"SEC 29"]
["SEC-2017-0067R01","SEC 29 agenda","WG Chair (Gemalto)","2017-05-18T16:12:26","Draft","AG",null,"SEC 29"]
["SEC-2017-0067R02","SEC 29 agenda","WG Chair (Gemalto)","2017-05-22T02:15:36","Draft","AG",null,"SEC 29"]
["SEC-2017-0070","CR_TS-0003_R2_clause_8_8_3","Qualcomm Inc. (TIA)","2017-05-22T02:29:27","Draft","CR",null,"SEC 29"]
["SEC-2017-0066R01","TS-0032_addressing_editors_notes","Qualcomm Inc. (TIA)","2017-05-22T03:04:36","Draft","INC",null,"SEC 29"]
["SEC-2017-0067R03","SEC 29 agenda","WG Chair (Gemalto)","2017-05-22T04:12:42","Agreed","AG",null,"SEC 29"]
["SEC-2017-0069","CR TS-0003 MEF Enrolment Exchange","Qualcomm Inc.","2017-05-22T05:57:58","Draft","CR",null,"SEC 29"]
["SEC-2017-0063R01","Distributed authorization resource lifecycle description","Datang","2017-05-22T16:08:24","Draft","CR",null,"SEC 29"]
["SEC-2017-0062R01","Update specification distributed authorization into clause 7","Datang","2017-05-22T16:09:11","Draft","CR",null,"SEC 29"]
["SEC-2017-0064R02","CR TS-0003 R3 PKI SE Framework completion","Gemalto","2017-05-23T01:14:01","Draft","CR",null,"SEC 29"]
["SEC-2017-0074","CR TS-0003 R3 Referencing PKI SE framework","Gemalto","2017-05-23T01:19:39","Draft","CR",null,"SEC 29"]
["SEC-2017-0075","WI-0021 Revised schedule","WI Rapporteur (Gemalto)","2017-05-23T01:28:15","Agreed","INC",null,"SEC 29"]
["SEC-2017-0076","WI-0068 revised schedule","WI Rapporteur (Gemalto)","2017-05-23T01:34:43","Agreed","INC",null,"SEC 29"]
["SEC-2017-0067R04","SEC 29 agenda","WG Chair (Gemalto)","2017-05-23T01:52:14","Draft","AG",null,"SEC 29"]
["SEC-2017-0058R01","CR TS-0003 MEF Cert Prov Procedure SCEP","BT plc","2017-05-23T02:59:02","Draft","INC",null,"SEC 29"]
["SEC-2017-0073","SEC29_Minutes","Victoria Mitchell, Secretariat",null,"Draft","MIN",null,"SEC 29"]
["SEC-2017-0072","CR TS-0003 CSR Attributes","Qualcomm Inc.",null,"Draft","CR",null,"SEC 29"]
["SEC-2017-0071","CR_TS-0003_R2_clause_12","Qualcomm Inc. (TIA)",null,"Draft","CR",null,"SEC 29"]

{"sheet":"MAS","index":8,"n_rows":75,"n_cols":8,"rows_kept":75,"cut":false,"hidden":false,"merged":[]}
["SHORT DOC NB","SHORTNAME","SOURCE","UPLOADED","STATUS","DOC TYPE","VERS","MEETING"]
["MAS-2017-0087","Discussion on current and target data points","Andreas Kraft (Deutsche Telekom)","2017-05-03T11:53:47","Postponed","INC",null,"MAS 29"]
["MAS-2017-0088","Adding a new ModuleClass for retrieving and setting movement information","Andreas Kraft (Deutsche Telekom)","2017-05-03T11:55:16","Noted","CR",null,"MAS 29"]
["MAS-2017-0058R03","Adding geoLocation to TS-0023","Andreas Kraft (Deutsche Telekom)","2017-05-03T11:56:14","Agreed","CR",null,"MAS 29"]
["MAS-2017-0093","WoT Interworking Scenarios","Yongjing Zhang (Huawei)","2017-05-10T15:45:57","Draft","INC",null,"MAS 29"]
["MAS-2017-0094","WoT Interworking Background for TR-0042","Convida, Huawei","2017-05-11T17:36:23","Noted","CR",null,"MAS 29"]
["MAS-2017-0095","Adding_omaDevice_module _to_TS-0023","NTT","2017-05-12T09:08:39","Noted","CR",null,"MAS 29"]
["MAS-2017-0096","Semantic Mashup for TS-0034","Convida","2017-05-12T13:36:37","Draft","CR",null,"MAS 29"]
["MAS-2017-0097","Request Parameter for Semantic Query for TR-0033","Convida","2017-05-12T17:01:20","Draft","CR",null,"MAS 29"]
["MAS-2017-0100","Guidelines_for_Mapping_ LWM2M_Objects","Convida","2017-05-12T18:49:57","Draft","CR",null,"MAS 29"]
["MAS-2017-0101","TS-0014_Updates_for_LWM2M_Interworking_with_mgmtObjects","Convida","2017-05-12T18:52:20","Draft","CR",null,"MAS 29"]
["MAS-2017-0102","HAIM_modification_for_airPurifier_model","LG Electronics","2017-05-15T06:01:49","Agreed","CR",null,"MAS 29"]
["MAS-2017-0108","HAIM_modification_for_clothesDryer_model","LG Electronics","2017-05-15T06:02:26","Agreed","CR",null,"MAS 29"]
["MAS-2017-0109","HAIM_modification_for_TV_model","LG Electronics","2017-05-15T06:03:00","Draft","CR",null,"MAS 29"]
["MAS-2017-0104","HAIM_modification_for_dehumidifier_model","LG Electronics","2017-05-15T06:18:35","Draft","CR",null,"MAS 29"]
["MAS-2017-0106","HAIM_modification_for_freezer_model","LG Electronics","2017-05-15T07:03:16","Noted","CR",null,"MAS 29"]
["MAS-2017-0107","HAIM_modification_for_printMultiFunction_model","LG Electronics","2017-05-15T08:12:27","Draft","CR",null,"MAS 29"]
["MAS-2017-0118","LwM2M_Event_Log_Mapping","Huawei Technologies Co., Ltd.","2017-05-15T09:02:53","Draft","CR",null,"MAS 29"]
["MAS-2017-0116","CR TS-0012 minor corrections to the base ontology","NEC","2017-05-15T12:33:18","Agreed","AG",null,"MAS 29"]
["MAS-2017-0103","HAIM_modification_for_airQualityMon_model","LG Electronics","2017-05-16T06:59:50","Agreed","CR",null,"MAS 29"]
["MAS-2017-0120","TS-0006-Management_enablement_(BBF)-V3_3_0-Draft-Baseline","Timothy Carey, Nokia","2017-05-16T13:25:49","Noted","INC",null,"MAS 29"]
["MAS-2017-0092","MAS#29 Doc allocation","Yongjing Zhang (Huawei, MAS Chair)","2017-05-18T10:00:55","Draft","AG",null,"MAS 29"]
["MAS-2017-0091","MAS#29 Agenda","Yongjing Zhang (Huawei, MAS Chair)","2017-05-18T10:01:07","Draft","AG",null,"MAS 29"]
["MAS-2017-0092R01","MAS#29 Doc allocation","Yongjing Zhang (Huawei, MAS Chair)","2017-05-19T03:41:14","Draft","AG",null,"MAS 29"]
["MAS-2017-0093R01","WoT Interworking Scenarios","Yongjing Zhang (Huawei)","2017-05-19T04:22:32","Agreed","INC",null,"MAS 29"]
["MAS-2017-0115","HAIM modification for set top box model","QUALCOMM Inc. (TIA)","2017-05-19T05:11:14","Draft","CR",null,"MAS 29"]
["MAS-2017-0114","HAIM modification for food prove model","QUALCOMM Inc. (TIA)","2017-05-19T05:48:54","Draft","CR",null,"MAS 29"]
["MAS-2017-0117","New type definitions for Generic Interworking","NEC","2017-05-19T21:19:53","Noted","INC",null,"MAS 29"]
["MAS-2017-0118R01","LwM2M_Event_Log_Mapping","Huawei Technologies Co., Ltd.","2017-05-20T10:51:22","Draft","CR",null,"MAS 29"]
["MAS-2017-0118R02","LwM2M_Event_Log_Mapping","Huawei Technologies Co., Ltd.","2017-05-22T03:47:11","Noted","CR",null,"MAS 29"]
["MAS-2017-0121","TS-0022_corrections","Qualcomm Inc. (TIA)","2017-05-22T06:14:50","Noted","CR",null,"MAS 29"]
["MAS-2017-0120R01","TS-0006-Management_enablement_(BBF)-V3_3_0-Draft-Baseline","Timothy Carey, Nokia","2017-05-22T08:05:16","Agreed","INC",null,"MAS 29"]
["MAS-2017-0091R01","MAS#29 Agenda","Yongjing Zhang (Huawei, MAS Chair)","2017-05-22T08:23:57","Agreed","AG",null,"MAS 29"]
["MAS-2017-0111","HAIM modification for scanner model","QUALCOMM Inc. (TIA)","2017-05-22T08:29:01","Draft","CR",null,"MAS 29"]
["MAS-2017-0110","HAIM modification for receiver model","QUALCOMM Inc. (TIA)","2017-05-22T09:28:18","Draft","CR",null,"MAS 29"]
["MAS-2017-0095R01","Adding_omaDevice_module _to_TS-0023","NTT","2017-05-22T13:35:56","Draft","CR",null,"MAS 29"]
["MAS-2017-0123","Discussion on updating multiple data points in ModuleClasses","Andreas Kraft (Deutsche Telekom), Orange","2017-05-23T02:55:05","Draft","AG",null,"MAS 29"]
["MAS-2017-0110R01","HAIM modification for receiver model","QUALCOMM Inc. (TIA)","2017-05-23T03:21:20","Draft","CR",null,"MAS 29"]
["MAS-2017-0114R01","HAIM modification for food prove model","QUALCOMM Inc. (TIA)","2017-05-23T03:21:46","Agreed","CR",null,"MAS 29"]
["MAS-2017-0111R01","HAIM modification for scanner model","QUALCOMM Inc. (TIA)","2017-05-23T03:22:14","Agreed","CR",null,"MAS 29"]
["MAS-2017-0115R01","HAIM modification for set top box model","QUALCOMM Inc. (TIA)","2017-05-23T03:27:19","Noted","CR",null,"MAS 29"]
["MAS-2017-0104R01","HAIM_modification_for_dehumidifier_model","LG Electronics","2017-05-23T03:30:48","Agreed","CR",null,"MAS 29"]
["MAS-2017-0107R01","HAIM_modification_for_printMultiFunction_model","LG Electronics","2017-05-23T03:31:37","Agreed","CR",null,"MAS 29"]
["MAS-2017-0109R01","HAIM_modification_for_TV_model","LG Electronics","2017-05-23T03:33:00","Noted","CR",null,"MAS 29"]
["MAS-2017-0113","HAIM modification for cooktop model","QUALCOMM Inc. (TIA)","2017-05-23T04:03:41","Draft","CR",null,"MAS 29"]
["MAS-2017-0088R01","Adding a new ModuleClass for retrieving and setting movement information","Andreas Kraft (Deutsche Telekom)","2017-05-23T04:07:43","Noted","CR",null,"MAS 29"]
["MAS-2017-0101R01","TS-0014_Updates_for_LWM2M_Interworking_with_mgmtObjects","Convida","2017-05-23T05:28:38","Agreed","CR",null,"MAS 29"]
["MAS-2017-0100R01","Guidelines_for_Mapping_ LWM2M_Objects","Convida","2017-05-23T05:29:18","Agreed","CR",null,"MAS 29"]
["MAS-2017-0123R01","Discussion on updating multiple data points in ModuleClasses","Andreas Kraft (Deutsche Telekom), Orange","2017-05-23T05:59:31","Draft","AG",null,"MAS 29"]
["MAS-2017-0118R03","LwM2M_Event_Log_Mapping","Huawei Technologies Co., Ltd.","2017-05-23T07:24:19","Noted","CR",null,"MAS 29"]
["MAS-2017-0088R02","Adding a new ModuleClass for retrieving and setting movement information","Andreas Kraft (Deutsche Telekom)","2017-05-23T09:31:23","Draft","CR",null,"MAS 29"]
["MAS-2017-0121R01","TS-0022_corrections","Qualcomm Inc. (TIA)","2017-05-23T10:41:23","Draft","CR",null,"MAS 29"]
["MAS-2017-0092R02","MAS#29 Doc allocation","Yongjing Zhang (Huawei, MAS Chair)","2017-05-23T14:48:23","Draft","AG",null,"MAS 29"]
["MAS-2017-0092R03","MAS#29 Doc allocation","Yongjing Zhang (Huawei, MAS Chair)","2017-05-23T14:48:41","Draft","AG",null,"MAS 29"]
["MAS-2017-0124","TR-0046 DASE case study","SyncTechno, KETI","2017-05-24T02:34:11","Draft","INC",null,"MAS 29"]
["MAS-2017-0118R04","LwM2M_Event_Log_Mapping","Huawei Technologies Co., Ltd.","2017-05-24T10:16:37","Draft","CR",null,"MAS 29"]
["MAS-2017-0094R01","WoT Interworking Background for TR-0042","Convida, Huawei","2017-05-24T11:29:02","Draft","CR",null,"MAS 29"]
["MAS-2017-0121R02","TS-0022_corrections","Qualcomm Inc. (TIA)","2017-05-24T16:03:23","Draft","CR",null,"MAS 29"]
["MAS-2017-0117R01","New type definitions for Generic Interworking","NEC","2017-05-24T16:38:59","Draft","INC",null,"MAS 29"]
["MAS-2017-0115R02","HAIM modification for set top box model","QUALCOMM Inc. (TIA)","2017-05-25T02:46:19","Draft","CR",null,"MAS 29"]
["MAS-2017-0110R02","HAIM modification for receiver model","QUALCOMM Inc. (TIA)","2017-05-25T02:55:45","Draft","CR",null,"MAS 29"]
["MAS-2017-0109R02","HAIM_modification_for_TV_model","LG Electronics","2017-05-25T03:02:43","Draft","CR",null,"MAS 29"]
["MAS-2017-0109R03","HAIM_modification_for_TV_model","LG Electronics","2017-05-25T03:41:21","Draft","CR",null,"MAS 29"]
["MAS-2017-0095R02","Adding_omaDevice_module _to_TS-0023","NTT","2017-05-25T05:31:01","Draft","CR",null,"MAS 29"]
["MAS-2017-0088R03","Adding a new ModuleClass for retrieving and setting movement information","Andreas Kraft (Deutsche Telekom)","2017-05-25T05:38:14","Draft","CR",null,"MAS 29"]
["MAS-2017-0121R03","TS-0022_corrections","Qualcomm Inc. (TIA)","2017-05-25T05:43:59","Draft","CR",null,"MAS 29"]
["MAS-2017-0094R02","WoT Interworking Background for TR-0042","Convida, Huawei","2017-05-25T06:02:56","Draft","CR",null,"MAS 29"]
["MAS-2017-0121R04","TS-0022_corrections","Qualcomm Inc. (TIA)","2017-05-25T06:04:58","Draft","CR",null,"MAS 29"]
["MAS-2017-0113R01","HAIM modification for cooktop model","QUALCOMM Inc. (TIA)","2017-05-25T06:11:04","Draft","CR",null,"MAS 29"]
["MAS-2017-0110R03","HAIM modification for receiver model","QUALCOMM Inc. (TIA)","2017-05-25T06:22:34","Draft","CR",null,"MAS 29"]
["MAS-2017-0096R01","Semantic Mashup for TS-0034","Convida","2017-05-25T06:45:12","Draft","CR",null,"MAS 29"]
["MAS-2017-0124R01","TR-0046 DASE case study","SyncTechno, KETI","2017-05-25T06:57:59","Draft","INC",null,"MAS 29"]
["MAS-2017-0122","MAS29_Minutes","Victoria Mitchell, Secretariat",null,"Draft","MIN",null,"MAS 29"]
["MAS-2017-0112","HAIM modification for cookerHood model","QUALCOMM Inc. (TIA)",null,"Draft","CR",null,"MAS 29"]
["MAS-2017-0105","HAIM modification for camera model","QUALCOMM Inc. (TIA)",null,"Draft","CR",null,"MAS 29"]

{"sheet":"TST","index":9,"n_rows":4,"n_cols":8,"rows_kept":4,"cut":false,"hidden":false,"merged":[]}
["SHORT DOC NB","SHORTNAME","SOURCE","UPLOADED","STATUS","DOC TYPE","VERS","MEETING"]
["TST-2017-0135","Analysis_of_missing_TPs_v0_2","Keebum Kim , TTA","2017-05-10T12:28:56","Draft","INC",null,"TST 29"]
["TST-2017-0136","Requirements_Management_tool_SquashTM","Easy Global Market","2017-05-11T13:36:39","Draft","INC",null,"TST 29"]
["TST-2017-0137","Requirements_Management_tool_SquashTM","Easy Global Market","2017-05-11T13:38:46","Withdrawn","INC",null,"TST 29"]