{"text_format":"1","workbook":"xlsx","n_sheets":10,"sheets":["Document Allocation","logistics","AllDocs","TP","REQ","ARC","PRO","SEC","MAS","TST"],"not_rendered":{"charts":0,"images":1,"macros":1,"external_links":0,"defined_names":14,"comments":0,"pivot_tables":0},"unopened":[],"bounds":{"document_bytes":16777216,"sheet_cells":100000,"rows_first":2000,"rows_last":500,"rows_between":2000,"halvings":0,"cell_chars":16384,"cell_head_chars":4096},"cells_cut":0,"cells_raw":0,"read":"whole","date_system":"1900"}

{"sheet":"Document Allocation","index":0,"n_rows":146,"n_cols":13,"rows_kept":146,"cut":false,"hidden":false,"merged":[]}
["Slot","WG",null,"Doc-Number","Title","Source","Upload Time","WG disposition (Agreed, Noted, Postponed, Withdrawn)","Type (INC, CR, AG, MIN)","Work Item","Rel","Purpose","Notes"]
["Mon-4 (15:30-17:00)",{"$f":"VLOOKUP(A2,logistics!G:I,2,0)","v":"MADRID 3"},{"$f":"VLOOKUP(A2,logistics!G:I,3,0)","v":"MAS"},"MAS-2017-0091",{"$f":"VLOOKUP(D2,AllDocs!A:D,2,0)","v":"MAS#29 Agenda"},{"$f":"VLOOKUP(D2,AllDocs!A:D,3,0)","v":"Yongjing Zhang (Huawei, MAS Chair)"},{"$f":"VLOOKUP(D2,AllDocs!A:D,4,0)","v":"2017-05-18T10:01:07"},"Noted",{"$f":"VLOOKUP(D2,AllDocs!A:F,6,0)","v":"AG"}]
["Mon-4 (15:30-17:00)",{"$f":"VLOOKUP(A3,logistics!G:I,2,0)","v":"MADRID 3"},{"$f":"VLOOKUP(A3,logistics!G:I,3,0)","v":"MAS"},"MAS-2017-0091R01",{"$f":"VLOOKUP(D3,AllDocs!A:D,2,0)","v":"MAS#29 Agenda"},{"$f":"VLOOKUP(D3,AllDocs!A:D,3,0)","v":"Yongjing Zhang (Huawei, MAS Chair)"},{"$f":"VLOOKUP(D3,AllDocs!A:D,4,0)","v":"2017-05-22T08:23:57"},"Agreed",{"$f":"VLOOKUP(D3,AllDocs!A:F,6,0)","v":"AG"}]
["Mon-4 (15:30-17:00)",{"$f":"VLOOKUP(A4,logistics!G:I,2,0)","v":"MADRID 3"},{"$f":"VLOOKUP(A4,logistics!G:I,3,0)","v":"MAS"},"MAS-2017-0092",{"$f":"VLOOKUP(D4,AllDocs!A:D,2,0)","v":"MAS#29 Doc allocation"},{"$f":"VLOOKUP(D4,AllDocs!A:D,3,0)","v":"Yongjing Zhang (Huawei, MAS Chair)"},{"$f":"VLOOKUP(D4,AllDocs!A:D,4,0)","v":"2017-05-18T10:00:55"},"Noted",{"$f":"VLOOKUP(D4,AllDocs!A:F,6,0)","v":"AG"}]
["Mon-4 (15:30-17:00)",{"$f":"VLOOKUP(A5,logistics!G:I,2,0)","v":"MADRID 3"},{"$f":"VLOOKUP(A5,logistics!G:I,3,0)","v":"MAS"},"MAS-2017-0120",{"$f":"VLOOKUP(D5,AllDocs!A:D,2,0)","v":"TS-0006-Management_enablement_(BBF)-V3_3_0-Draft-Baseline"},{"$f":"VLOOKUP(D5,AllDocs!A:D,3,0)","v":"Timothy Carey, Nokia"},{"$f":"VLOOKUP(D5,AllDocs!A:D,4,0)","v":"2017-05-16T13:25:49"},"Noted",{"$f":"VLOOKUP(D5,AllDocs!A:F,6,0)","v":"INC"},"TS-0006 (WI-0010)",3]
["Mon-4 (15:30-17:00)",{"$f":"VLOOKUP(A6,logistics!G:I,2,0)","v":"MADRID 3"},{"$f":"VLOOKUP(A6,logistics!G:I,3,0)","v":"MAS"},"MAS-2017-0120R01",{"$f":"VLOOKUP(D6,AllDocs!A:D,2,0)","v":"TS-0006-Management_enablement_(BBF)-V3_3_0-Draft-Baseline"},{"$f":"VLOOKUP(D6,AllDocs!A:D,3,0)","v":"Timothy Carey, Nokia"},{"$f":"VLOOKUP(D6,AllDocs!A:D,4,0)","v":"2017-05-22T08:05:16"},"Agreed",{"$f":"VLOOKUP(D6,AllDocs!A:F,6,0)","v":"INC"},"TS-0006 (WI-0010)",3]
["Mon-4 (15:30-17:00)",{"$f":"VLOOKUP(A7,logistics!G:I,2,0)","v":"MADRID 3"},{"$f":"VLOOKUP(A7,logistics!G:I,3,0)","v":"MAS"},"MAS-2017-0118",{"$f":"VLOOKUP(D7,AllDocs!A:D,2,0)","v":"LwM2M_Event_Log_Mapping"},{"$f":"VLOOKUP(D7,AllDocs!A:D,3,0)","v":"Huawei Technologies Co., Ltd."},{"$f":"VLOOKUP(D7,AllDocs!A:D,4,0)","v":"2017-05-15T09:02:53"},"Noted",{"$f":"VLOOKUP(D7,AllDocs!A:F,6,0)","v":"CR"},"TS-0005 (WI-0010)",3]
["Mon-4 (15:30-17:00)",{"$f":"VLOOKUP(A8,logistics!G:I,2,0)","v":"MADRID 3"},{"$f":"VLOOKUP(A8,logistics!G:I,3,0)","v":"MAS"},"MAS-2017-0118R01",{"$f":"VLOOKUP(D8,AllDocs!A:D,2,0)","v":"LwM2M_Event_Log_Mapping"},{"$f":"VLOOKUP(D8,AllDocs!A:D,3,0)","v":"Huawei Technologies Co., Ltd."},{"$f":"VLOOKUP(D8,AllDocs!A:D,4,0)","v":"2017-05-20T10:51:22"},"Noted",{"$f":"VLOOKUP(D8,AllDocs!A:F,6,0)","v":"CR"},"TS-0005 (WI-0010)",3]
["Mon-4 (15:30-17:00)",{"$f":"VLOOKUP(A9,logistics!G:I,2,0)","v":"MADRID 3"},{"$f":"VLOOKUP(A9,logistics!G:I,3,0)","v":"MAS"},"MAS-2017-0118R02",{"$f":"VLOOKUP(D9,AllDocs!A:D,2,0)","v":"LwM2M_Event_Log_Mapping"},{"$f":"VLOOKUP(D9,AllDocs!A:D,3,0)","v":"Huawei Technologies Co., Ltd."},{"$f":"VLOOKUP(D9,AllDocs!A:D,4,0)","v":"2017-05-22T03:47:11"},"Noted",{"$f":"VLOOKUP(D9,AllDocs!A:F,6,0)","v":"CR"},"TS-0005 (WI-0010)",3,null,"the detailed data type mapping needs to be aligned between TS-0004 and LwM2M resources.\nIt's ok to register to OMA from oneM2M perspective, and LS to OMA for comments.\nR03 Expected."]
["Mon-4 (15:30-17:00)",{"$f":"VLOOKUP(A10,logistics!G:I,2,0)","v":"MADRID 3"},{"$f":"VLOOKUP(A10,logistics!G:I,3,0)","v":"MAS"},"MAS-2017-0058R03",{"$f":"VLOOKUP(D10,AllDocs!A:D,2,0)","v":"Adding geoLocation to TS-0023"},{"$f":"VLOOKUP(D10,AllDocs!A:D,3,0)","v":"Andreas Kraft (Deutsche Telekom)"},{"$f":"VLOOKUP(D10,AllDocs!A:D,4,0)","v":"2017-05-03T11:56:14"},"Agreed",{"$f":"VLOOKUP(D10,AllDocs!A:F,6,0)","v":"CR"},"TS-0023 (WI-0056)",3]
["Mon-4 (15:30-17:00)",{"$f":"VLOOKUP(A11,logistics!G:I,2,0)","v":"MADRID 3"},{"$f":"VLOOKUP(A11,logistics!G:I,3,0)","v":"MAS"},"MAS-2017-0088",{"$f":"VLOOKUP(D11,AllDocs!A:D,2,0)","v":"Adding a new ModuleClass for retrieving and setting movement information"},{"$f":"VLOOKUP(D11,AllDocs!A:D,3,0)","v":"Andreas Kraft (Deutsche Telekom)"},{"$f":"VLOOKUP(D11,AllDocs!A:D,4,0)","v":"2017-05-03T11:55:16"},"Noted",{"$f":"VLOOKUP(D11,AllDocs!A:F,6,0)","v":"CR"},"TS-0023 (WI-0056)",3,null,"R01 expectd"]
["Mon-4 (15:30-17:00)",{"$f":"VLOOKUP(A12,logistics!G:I,2,0)","v":"MADRID 3"},{"$f":"VLOOKUP(A12,logistics!G:I,3,0)","v":"MAS"},"MAS-2017-0087",{"$f":"VLOOKUP(D12,AllDocs!A:D,2,0)","v":"Discussion on current and target data points"},{"$f":"VLOOKUP(D12,AllDocs!A:D,3,0)","v":"Andreas Kraft (Deutsche Telekom)"},{"$f":"VLOOKUP(D12,AllDocs!A:D,4,0)","v":"2017-05-03T11:53:47"},"Noted",{"$f":"VLOOKUP(D12,AllDocs!A:F,6,0)","v":"INC"},"TS-0023 (WI-0056)",3,"Discussion","AI: Andreas: to review existing module classes to see any need to distinguish current and target status (only if necessary)"]
["Mon-4 (15:30-17:00)",{"$f":"VLOOKUP(A13,logistics!G:I,2,0)","v":"MADRID 3"},{"$f":"VLOOKUP(A13,logistics!G:I,3,0)","v":"MAS"},"MAS-2017-0095",{"$f":"VLOOKUP(D13,AllDocs!A:D,2,0)","v":"Adding_omaDevice_module _to_TS-0023"},{"$f":"VLOOKUP(D13,AllDocs!A:D,3,0)","v":"NTT"},{"$f":"VLOOKUP(D13,AllDocs!A:D,4,0)","v":"2017-05-12T09:08:39"},"Noted",{"$f":"VLOOKUP(D13,AllDocs!A:F,6,0)","v":"CR"},"TS-0023 (WI-0056)",3,null,"R01 expectd"]
["Mon-5 (17:00-18:30)",{"$f":"VLOOKUP(A14,logistics!G:I,2,0)","v":"MADRID 5 "},{"$f":"VLOOKUP(A14,logistics!G:I,3,0)","v":"MAS-adhoc"},"MAS-2017-0102",{"$f":"VLOOKUP(D14,AllDocs!A:D,2,0)","v":"HAIM_modification_for_airPurifier_model"},{"$f":"VLOOKUP(D14,AllDocs!A:D,3,0)","v":"LG Electronics"},{"$f":"VLOOKUP(D14,AllDocs!A:D,4,0)","v":"2017-05-15T06:01:49"},null,{"$f":"VLOOKUP(D14,AllDocs!A:F,6,0)","v":"CR"},"TS-0023 (WI-0056)",3,null,"ready to go"]
["Mon-5 (17:00-18:30)",{"$f":"VLOOKUP(A15,logistics!G:I,2,0)","v":"MADRID 5 "},{"$f":"VLOOKUP(A15,logistics!G:I,3,0)","v":"MAS-adhoc"},"MAS-2017-0103",{"$f":"VLOOKUP(D15,AllDocs!A:D,2,0)","v":"HAIM_modification_for_airQualityMon_model"},{"$f":"VLOOKUP(D15,AllDocs!A:D,3,0)","v":"LG Electronics"},{"$f":"VLOOKUP(D15,AllDocs!A:D,4,0)","v":"2017-05-16T06:59:50"},null,{"$f":"VLOOKUP(D15,AllDocs!A:F,6,0)","v":"CR"},"TS-0023 (WI-0056)",3,null,"ready to go"]
{"$rows_left_out":132}
{"sheet":"logistics","index":1,"n_rows":32,"n_cols":13,"rows_kept":32,"cut":false,"hidden":false,"merged":[]}
["WeekDay","SlotTime","Day","Slot","Time","AllSlots","MAS Slots","Rooms","WGs","WIs","Short Name","Deadline","non-duplicated contribution number"]
["Mon","9:00-10:30","Mon",1,"9:00-10:30",{"$f":"CONCATENATE(C2,\"-\",D2,\" (\",E2,\")\")","v":"Mon-1 (9:00-10:30)"},{"$f":"IF(COUNTA(I2),CELL(\"contents\",F2),\"\")","v":""},null,null,"TR-0001 (WI-0015)","Use Case Continuation","2017-05-15T01:00:00",{"$f":"SUMPRODUCT(1/COUNTIF('Document Allocation'!D2:D112,'Document Allocation'!D2:D112))","v":83.075675675675654}]
["Tue","10:30-11:00","Mon",2,"11:00-12:30","Mon-2 (11:00-12:30)",{"$f":"IF(COUNTA(I3),CELL(\"contents\",F3),\"\")","v":""},null,null,"TR-0007 (WI-0053)","Semantic Study",null," "]
["Wed","11:00-12:30","Mon",3,"13:30-15:00",{"$f":"CONCATENATE(C4,\"-\",D4,\" (\",E4,\")\")","v":"Mon-3 (13:30-15:00)"},"",null,null,"TR-0014 (WI-0018)","oneM2M AllJoyn Interworking"]
["Thu","12:30-13:30","Mon",4,"15:30-17:00",{"$f":"CONCATENATE(C5,\"-\",D5,\" (\",E5,\")\")","v":"Mon-4 (15:30-17:00)"},{"$f":"IF(COUNTA(I5),CELL(\"contents\",F5),\"\")","v":"Mon-4 (15:30-17:00)"},"MADRID 3","MAS","TR-0017 (WI-0017)","Home Domain Abstract Information Model"]
["Fri","13:30-15:00","Mon",5,"17:00-18:30","Mon-5 (17:00-18:30)","Mon-5 (17:00-18:30)","MADRID 5 ","MAS-adhoc","TR-0018 (WI-0059)","Industry Domain Enablement"]
[null,"15:00-15:30","Tue",1,"08:30-10:00","Tue-1 (08:30-10:00)","",null,null,"TR-0022 (WI-0043)","Continuation & integration of HGI Smart Home activities"]
[null,"15:30-17:00","Tue",2,"10:30-12:00","Tue-2 (10:30-12:00)","Tue-2 (10:30-12:00)","MADRID 3","MAS","TR-0031 (WI-0052)","LWM2M DM Interworking Enhancement"]
[null,"17:00-18:30","Tue",3,"13:30-15:00",{"$f":"CONCATENATE(C9,\"-\",D9,\" (\",E9,\")\")","v":"Tue-3 (13:30-15:00)"},"",null,null,"TR-0039 (WI-0054)","Developer guide-SDT-based implementation"]
[null,null,"Tue",4,"15:30-17:00","Tue-4 (15:30-17:00)","Tue-4 (15:30-17:00)","MADRID 3","MAS","TR-0033 (WI-0053)","Study on Enhanced Semantic Enablement"]
[null,"08:30-10:00","Tue",5,"17:00-18:30","Tue-5 (17:00-18:30)","Tue-5 (17:00-18:30)","MADRID 2","ARC/MAS","TR-0042 (WI-0071)","WoT Interworking"]
[null,"10:00-10:30","Wed",1,"08:30-10:00","Wed-1 (08:30-10:00)","",null,null,"TR-0043 (WI-0072)","Modbus Interworking"]
[null,"10:30-12:00","Wed",2,"10:30-12:00","Wed-2 (10:30-12:00)","",null,null,"TR-0045 (WI-0054)","Developer Guide: Implementing Semantics"]
[null,"12:00-13:30","Wed",3,"13:30-15:00","Wed-3 (13:30-15:00)","",null,null,"TR-0046 (WI-0070)","Study on Disaster Alert Service Enabler"]
[null,"13:30-15:00","Wed",4,"15:30-17:00","Wed-4 (15:30-17:00)","",null,null,"TS-0001 (WI-0002)","Architecture"]
{"$rows_left_out":18}
{"sheet":"AllDocs","index":2,"n_rows":265,"n_cols":8,"rows_kept":265,"cut":false,"hidden":false,"merged":[]}
["SHORT DOC NB","SHORTNAME","SOURCE","UPLOADED","STATUS","DOC TYPE","VERS","MEETING"]
["TP-2017-0054","Invitation_to_TP29_Shenzhen_China","CCSA","2017-02-24T08:05:07","Noted","INV",null,"TP 29"]
["ARC-2017-0149","TR-0020 0.7.0 new baseline","Huawei Technologies Co., Ltd.","2017-04-01T13:54:07","Agreed","INC",null,"ARC 29"]
["TP-2017-0101","Reply LS to GSMA Mobile IoT response to oneM2M","3GPP SA2","2017-04-04T12:41:03","Noted","LS",null,"TP 29"]
["REQ-2017-0029R01","Draft-TR-0026-Vehicular_Domain_Enablement_v_0_8_0","KDDI, Huawei Technologies, LG Electronics","2017-04-06T00:50:19","Agreed","CR",null,"REQ 29"]
["TP-2017-0102","ETSI ISG MEC (Multi access Edge Computing) Phase 2","ETSI ISG MEC","2017-04-06T12:53:39","Noted","LS",null,"TP 29"]
["TP-2017-0103","LS on the new structure of ITU-T SG20","ITU-T SG20","2017-04-10T08:30:51","Noted","LS",null,"TP 29"]
["REQ-2017-0030","TR026 to TS002 new reqs already implemented","Convida","2017-04-10T17:29:43","Draft","CR",null,"REQ 29"]
["REQ-2017-0031","TR026 to TS002 new reqs not implemented","Convida","2017-04-10T17:29:56","Draft","CR",null,"REQ 29"]
["TP-2017-0106","Voting List for TP29","Karen Hughes, Secretariat","2017-04-19T14:10:19","Noted","INC",null,"TP 29"]
["TP-2017-0106R01","Voting List for TP29","Karen Hughes, Secretariat","2017-04-20T06:22:55","Approved","INC",null,"TP 29"]
["REQ-2017-0032","Draft-TR-0026-Vehicular_Domain_Enablement_v_0_8_1","KDDI, Huawei Technologies, LG Electronics","2017-04-26T13:16:27","Agreed","CR",null,"REQ 29"]
["MAS-2017-0087","Discussion on current and target data points","Andreas Kraft (Deutsche Telekom)","2017-05-03T11:53:47","Postponed","INC",null,"MAS 29"]
["MAS-2017-0088","Adding a new ModuleClass for retrieving and setting movement information","Andreas Kraft (Deutsche Telekom)","2017-05-03T11:55:16","Noted","CR",null,"MAS 29"]
["MAS-2017-0058R03","Adding geoLocation to TS-0023","Andreas Kraft (Deutsche Telekom)","2017-05-03T11:56:14","Agreed","CR",null,"MAS 29"]
{"$rows_left_out":251}
{"sheet":"TP","index":3,"n_rows":37,"n_cols":8,"rows_kept":37,"cut":false,"hidden":false,"merged":[]}
["SHORT DOC NB","SHORTNAME","SOURCE","UPLOADED","STATUS","DOC TYPE","VERS","MEETING"]
["TP-2017-0054","Invitation_to_TP29_Shenzhen_China","CCSA","2017-02-24T08:05:07","Noted","INV",null,"TP 29"]
["TP-2017-0101","Reply LS to GSMA Mobile IoT response to oneM2M","3GPP SA2","2017-04-04T12:41:03","Noted","LS",null,"TP 29"]
["TP-2017-0102","ETSI ISG MEC (Multi access Edge Computing) Phase 2","ETSI ISG MEC","2017-04-06T12:53:39","Noted","LS",null,"TP 29"]
["TP-2017-0103","LS on the new structure of ITU-T SG20","ITU-T SG20","2017-04-10T08:30:51","Noted","LS",null,"TP 29"]
["TP-2017-0106","Voting List for TP29","Karen Hughes, Secretariat","2017-04-19T14:10:19","Noted","INC",null,"TP 29"]
["TP-2017-0106R01","Voting List for TP29","Karen Hughes, Secretariat","2017-04-20T06:22:55","Approved","INC",null,"TP 29"]
["TP-2017-0108","Work Program Status TP#29 opening","Roland Hechwartner, WPM convenor","2017-05-12T13:50:33","Noted","STR",null,"TP 29"]
["TP-2017-0109","Release 3 Summary","TP VC / ARC VC","2017-05-12T19:47:09","Noted","INC",null,"TP 29"]
["TP-2017-0110","LS_to_OMA-DM_on_EventLog_LwM2M_Objects","Huawei Technologies Co., Ltd.","2017-05-15T08:30:13","Noted","LS",null,"TP 29"]
["TP-2017-0062R02","Newbies Session","Roland Hechwartner, Deutsche Telekom","2017-05-15T13:39:34","Draft","INC",null,"TP 29"]
["TP-2017-0111","Update_on_WI_0048_OSGi_Interworking","Huawei Technologies Co., Ltd.","2017-05-17T03:20:00","Noted","INC",null,"TP 29"]
["TP-2017-0113","Weekly Schedule TP29","Karen Hughes, Secretariat","2017-05-18T08:17:47","Noted","INC",null,"TP 29"]
["TP-2017-0113R01","Weekly Schedule TP29","Karen Hughes, Secretariat","2017-05-18T13:19:17","Noted","INC",null,"TP 29"]
["TP-2017-0114","KEPCO_e-IoT_deployment","KEPCO, ETRI","2017-05-18T23:15:03","Draft","INC",null,"TP 29"]
{"$rows_left_out":23}
{"sheet":"REQ","index":4,"n_rows":7,"n_cols":8,"rows_kept":7,"cut":false,"hidden":false,"merged":[]}
["SHORT DOC NB","SHORTNAME","SOURCE","UPLOADED","STATUS","DOC TYPE","VERS","MEETING"]
["REQ-2017-0029R01","Draft-TR-0026-Vehicular_Domain_Enablement_v_0_8_0","KDDI, Huawei Technologies, LG Electronics","2017-04-06T00:50:19","Agreed","CR",null,"REQ 29"]
["REQ-2017-0030","TR026 to TS002 new reqs already implemented","Convida","2017-04-10T17:29:43","Draft","CR",null,"REQ 29"]
["REQ-2017-0031","TR026 to TS002 new reqs not implemented","Convida","2017-04-10T17:29:56","Draft","CR",null,"REQ 29"]
["REQ-2017-0032","Draft-TR-0026-Vehicular_Domain_Enablement_v_0_8_1","KDDI, Huawei Technologies, LG Electronics","2017-04-26T13:16:27","Agreed","CR",null,"REQ 29"]
["REQ-2017-0034","TR-0026 requirment matrix for CR tracking","Convida",null,"Draft","INC",null,"REQ 29"]
["REQ-2017-0033","TS-0002 updates based on TR-0026 requirements","Convida",null,"Draft","CR",null,"REQ 29"]

{"sheet":"ARC","index":5,"n_rows":95,"n_cols":8,"rows_kept":95,"cut":false,"hidden":false,"merged":[]}
["SHORT DOC NB","SHORTNAME","SOURCE","UPLOADED","STATUS","DOC TYPE","VERS","MEETING"]
["ARC-2017-0149","TR-0020 0.7.0 new baseline","Huawei Technologies Co., Ltd.","2017-04-01T13:54:07","Agreed","INC",null,"ARC 29"]
["ARC-2017-0174","TR-0018_New_Baseline","Hitachi","2017-05-12T01:32:09","Noted","CR",null,"ARC 29"]
["ARC-2017-0175","OPC-UA IWK Possible Impacts on oneM2M","Hitachi","2017-05-12T01:35:53","Noted","INC",null,"ARC 29"]
["ARC-2017-0176","Identifier_expression_in_common_attribute","NTT","2017-05-12T03:56:19","Draft","INC",null,"ARC 29"]
["ARC-2017-0177","Changing Distributed Authorization Resources","Datang","2017-05-12T07:27:20","Draft","CR",null,"ARC 29"]
["ARC-2017-0178","Changing Distributed Authorization Resource Procedures","Datang","2017-05-12T07:32:56","Draft","CR",null,"ARC 29"]
["ARC-2017-0179","Updating Distributed Authorization Clause11","Datang","2017-05-12T07:36:20","Draft","CR",null,"ARC 29"]
["ARC-2017-0180","Increasing_the usage_flexibility_of_timeSeries_and_timeSeriesInstance","NTT","2017-05-12T09:00:46","Noted","CR",null,"ARC 29"]
["ARC-2017-0181","Adding_common_attributes_for_interworking","NTT","2017-05-12T09:05:32","Draft","CR",null,"ARC 29"]
["ARC-2017-0182","Operation_Execution_Time_update","ZTE","2017-05-12T09:07:37","Noted","CR",null,"ARC 29"]
["ARC-2017-0183","Modbus_Interworking_Scenarios","ZTE","2017-05-12T09:14:01","Noted","INC",null,"ARC 29"]
["ARC-2017-0191","Semantic Query and Semantic Content","NEC","2017-05-12T17:15:01","Draft","INC",null,"ARC 29"]
["ARC-2017-0192","mgmtObj_objectID_attribute","Convida","2017-05-12T18:45:03","Draft","CR",null,"ARC 29"]
["ARC-2017-0193","Service_Enabled_AE","Convida","2017-05-12T18:56:23","Noted","CR",null,"ARC 29"]
{"$rows_left_out":81}
{"sheet":"PRO","index":6,"n_rows":26,"n_cols":8,"rows_kept":26,"cut":false,"hidden":false,"merged":[]}
["SHORT DOC NB","SHORTNAME","SOURCE","UPLOADED","STATUS","DOC TYPE","VERS","MEETING"]
["PRO-2017-0092","Updated reference for CoAP on Rel-1","KT","2017-05-12T01:23:59","Draft","CR",null,"PRO 29"]
["PRO-2017-0093","Updated reference for CoAP on Rel-2","KT","2017-05-12T01:27:38","Draft","CR",null,"PRO 29"]
["PRO-2017-0094","MQTT server co-located within a node on Rel-1","KT","2017-05-12T01:50:07","Draft","CR",null,"PRO 29"]
["PRO-2017-0095","MQTT server co-located within a node on Rel-2","KT","2017-05-12T01:51:53","Draft","CR",null,"PRO 29"]
["PRO-2017-0096","MQTT server located independently from nodes on Rel-1","KT","2017-05-12T02:05:54","Draft","CR",null,"PRO 29"]
["PRO-2017-0097","MQTT server located independently from nodes on Rel-2","KT","2017-05-12T02:08:22","Draft","CR",null,"PRO 29"]
["PRO-2017-0098","Connecting to MQTT on Rel-1","KT","2017-05-12T02:23:58","Draft","CR",null,"PRO 29"]
["PRO-2017-0099","Connecting to MQTT on Rel-2","KT","2017-05-12T02:26:16","Draft","CR",null,"PRO 29"]
["PRO-2017-0100","MQTT Request and Response Messages on Rel-1","KT","2017-05-12T04:23:20","Draft","CR",null,"PRO 29"]
["PRO-2017-0101","MQTT Request and Response Messages on Rel-2","KT","2017-05-12T04:25:06","Draft","CR",null,"PRO 29"]
["PRO-2017-0102","MQTT Sending a Request on Rel-1","KT","2017-05-12T04:37:51","Draft","CR",null,"PRO 29"]
["PRO-2017-0103","MQTT Sending a Request on Rel-2","KT","2017-05-12T04:41:35","Draft","CR",null,"PRO 29"]
["PRO-2017-0104","Listening for and responding to a Request on Rel-1","KT","2017-05-12T04:47:08","Draft","CR",null,"PRO 29"]
["PRO-2017-0105","Listening for and responding to a Request on Rel-2","KT","2017-05-12T04:49:36","Draft","CR",null,"PRO 29"]
{"$rows_left_out":12}
{"sheet":"SEC","index":7,"n_rows":27,"n_cols":8,"rows_kept":27,"cut":false,"hidden":false,"merged":[]}
["SHORT DOC NB","SHORTNAME","SOURCE","UPLOADED","STATUS","DOC TYPE","VERS","MEETING"]
["SEC-2017-0062","Update specification distributed authorization into clause 7","Datang","2017-05-12T07:11:27","Draft","CR",null,"SEC 29"]
["SEC-2017-0063","Distributed authorization resource lifecycle description","Datang","2017-05-12T07:14:04","Draft","CR",null,"SEC 29"]
["SEC-2017-0064","CR TS-0003 R3 PKI SE Framework completion","Gemalto","2017-05-12T16:13:06","Draft","CR",null,"SEC 29"]
["SEC-2017-0065","CR TR-0041 Algorithm details","Huawei","2017-05-14T12:43:12","Draft","CR",null,"SEC 29"]
["SEC-2017-0061R02","CR_TS-0003_R2_Correction_to_Access_Control_mechanism","Qualcomm Inc. (TIA)","2017-05-14T20:19:45","Noted","CR",null,"SEC 29"]
["SEC-2017-0066","TS-0032_addressing_editors_notes","Qualcomm Inc. (TIA)","2017-05-14T20:52:32","Draft","INC",null,"SEC 29"]
["SEC-2017-0064R01","CR TS-0003 R3 PKI SE Framework completion","Gemalto","2017-05-15T14:38:14","Noted","CR",null,"SEC 29"]
["SEC-2017-0068","Overview_on_Decentralized_Authentication","Huawei","2017-05-16T07:48:29","Draft","INC",null,"SEC 29"]
["SEC-2017-0067","SEC 29 agenda","WG Chair (Gemalto)","2017-05-18T11:16:02","Draft","AG",null,"SEC 29"]
["SEC-2017-0067R01","SEC 29 agenda","WG Chair (Gemalto)","2017-05-18T16:12:26","Draft","AG",null,"SEC 29"]
["SEC-2017-0067R02","SEC 29 agenda","WG Chair (Gemalto)","2017-05-22T02:15:36","Draft","AG",null,"SEC 29"]
["SEC-2017-0070","CR_TS-0003_R2_clause_8_8_3","Qualcomm Inc. (TIA)","2017-05-22T02:29:27","Draft","CR",null,"SEC 29"]
["SEC-2017-0066R01","TS-0032_addressing_editors_notes","Qualcomm Inc. (TIA)","2017-05-22T03:04:36","Draft","INC",null,"SEC 29"]
["SEC-2017-0067R03","SEC 29 agenda","WG Chair (Gemalto)","2017-05-22T04:12:42","Agreed","AG",null,"SEC 29"]
{"$rows_left_out":13}
{"sheet":"MAS","index":8,"n_rows":75,"n_cols":8,"rows_kept":75,"cut":false,"hidden":false,"merged":[]}
["SHORT DOC NB","SHORTNAME","SOURCE","UPLOADED","STATUS","DOC TYPE","VERS","MEETING"]
["MAS-2017-0087","Discussion on current and target data points","Andreas Kraft (Deutsche Telekom)","2017-05-03T11:53:47","Postponed","INC",null,"MAS 29"]
["MAS-2017-0088","Adding a new ModuleClass for retrieving and setting movement information","Andreas Kraft (Deutsche Telekom)","2017-05-03T11:55:16","Noted","CR",null,"MAS 29"]
["MAS-2017-0058R03","Adding geoLocation to TS-0023","Andreas Kraft (Deutsche Telekom)","2017-05-03T11:56:14","Agreed","CR",null,"MAS 29"]
["MAS-2017-0093","WoT Interworking Scenarios","Yongjing Zhang (Huawei)","2017-05-10T15:45:57","Draft","INC",null,"MAS 29"]
["MAS-2017-0094","WoT Interworking Background for TR-0042","Convida, Huawei","2017-05-11T17:36:23","Noted","CR",null,"MAS 29"]
["MAS-2017-0095","Adding_omaDevice_module _to_TS-0023","NTT","2017-05-12T09:08:39","Noted","CR",null,"MAS 29"]
["MAS-2017-0096","Semantic Mashup for TS-0034","Convida","2017-05-12T13:36:37","Draft","CR",null,"MAS 29"]
["MAS-2017-0097","Request Parameter for Semantic Query for TR-0033","Convida","2017-05-12T17:01:20","Draft","CR",null,"MAS 29"]
["MAS-2017-0100","Guidelines_for_Mapping_ LWM2M_Objects","Convida","2017-05-12T18:49:57","Draft","CR",null,"MAS 29"]
["MAS-2017-0101","TS-0014_Updates_for_LWM2M_Interworking_with_mgmtObjects","Convida","2017-05-12T18:52:20","Draft","CR",null,"MAS 29"]
["MAS-2017-0102","HAIM_modification_for_airPurifier_model","LG Electronics","2017-05-15T06:01:49","Agreed","CR",null,"MAS 29"]
["MAS-2017-0108","HAIM_modification_for_clothesDryer_model","LG Electronics","2017-05-15T06:02:26","Agreed","CR",null,"MAS 29"]
["MAS-2017-0109","HAIM_modification_for_TV_model","LG Electronics","2017-05-15T06:03:00","Draft","CR",null,"MAS 29"]
["MAS-2017-0104","HAIM_modification_for_dehumidifier_model","LG Electronics","2017-05-15T06:18:35","Draft","CR",null,"MAS 29"]
{"$rows_left_out":61}
{"sheet":"TST","index":9,"n_rows":4,"n_cols":8,"rows_kept":4,"cut":false,"hidden":false,"merged":[]}
["SHORT DOC NB","SHORTNAME","SOURCE","UPLOADED","STATUS","DOC TYPE","VERS","MEETING"]
["TST-2017-0135","Analysis_of_missing_TPs_v0_2","Keebum Kim , TTA","2017-05-10T12:28:56","Draft","INC",null,"TST 29"]
["TST-2017-0136","Requirements_Management_tool_SquashTM","Easy Global Market","2017-05-11T13:36:39","Draft","INC",null,"TST 29"]
["TST-2017-0137","Requirements_Management_tool_SquashTM","Easy Global Market","2017-05-11T13:38:46","Withdrawn","INC",null,"TST 29"]