{"text_format":"1","workbook":"xlsx","n_sheets":10,"sheets":["Document Allocation","logistics","AllDocs","TP","REQ","ARC","PRO","SEC","MAS","TST"],"not_rendered":{"charts":0,"images":1,"macros":1,"external_links":0,"defined_names":23,"comments":0,"pivot_tables":0},"unopened":[],"bounds":{"document_bytes":16777216,"sheet_cells":100000,"rows_first":2000,"rows_last":500,"rows_between":2000,"halvings":0,"cell_chars":16384,"cell_head_chars":4096},"cells_cut":0,"cells_raw":0,"read":"whole","date_system":"1900"}

{"sheet":"Document Allocation","index":0,"n_rows":118,"n_cols":13,"rows_kept":118,"cut":false,"hidden":false,"merged":[]}
["Slot","Room","WG","Doc-Number","Title","Source","Upload Time","WG disposition (Agreed, Noted, Postponed, Withdrawn)","Type (INC, CR, AG, MIN)","Work Item","Rel","Purpose","Notes"]
["Mon-3 (13:30-15:00)",{"$f":"VLOOKUP(A2,logistics!G:I,2,0)","v":1},{"$f":"VLOOKUP(A2,logistics!G:I,3,0)","v":"MAS "},"MAS-2017-0224",{"$f":"VLOOKUP(D2,AllDocs!A:D,2,0)","v":"MAS#31 Agenda"},{"$f":"VLOOKUP(D2,AllDocs!A:D,3,0)","v":"Yongjing Zhang (Huawei, MAS Chair)"},{"$f":"VLOOKUP(D2,AllDocs!A:D,4,0)","v":"2017-09-12T13:12:50"},"Noted",{"$f":"VLOOKUP(D2,AllDocs!A:F,6,0)","v":"AG"}]
["Mon-3 (13:30-15:00)",{"$f":"VLOOKUP(A3,logistics!G:I,2,0)","v":1},{"$f":"VLOOKUP(A3,logistics!G:I,3,0)","v":"MAS "},"MAS-2017-0224R01",{"$f":"VLOOKUP(D3,AllDocs!A:D,2,0)","v":"MAS#31 Agenda"},{"$f":"VLOOKUP(D3,AllDocs!A:D,3,0)","v":"Yongjing Zhang (Huawei, MAS Chair)"},{"$f":"VLOOKUP(D3,AllDocs!A:D,4,0)","v":"2017-09-18T09:39:25"},"Agreed",{"$f":"VLOOKUP(D3,AllDocs!A:F,6,0)","v":"AG"}]
["Mon-3 (13:30-15:00)",{"$f":"VLOOKUP(A4,logistics!G:I,2,0)","v":1},{"$f":"VLOOKUP(A4,logistics!G:I,3,0)","v":"MAS "},"MAS-2017-0225R01",{"$f":"VLOOKUP(D4,AllDocs!A:D,2,0)","v":"MAS#31 Doc Allocation"},{"$f":"VLOOKUP(D4,AllDocs!A:D,3,0)","v":"Yongjing Zhang (Huawei, MAS Chair)"},{"$f":"VLOOKUP(D4,AllDocs!A:D,4,0)","v":"2017-09-15T07:40:10"},"Noted",{"$f":"VLOOKUP(D4,AllDocs!A:F,6,0)","v":"AG"}]
["Mon-3 (13:30-15:00)",{"$f":"VLOOKUP(A5,logistics!G:I,2,0)","v":1},{"$f":"VLOOKUP(A5,logistics!G:I,3,0)","v":"MAS "},"MAS-2017-0225R02",{"$f":"VLOOKUP(D5,AllDocs!A:D,2,0)","v":"MAS#31 Doc Allocation"},{"$f":"VLOOKUP(D5,AllDocs!A:D,3,0)","v":"Yongjing Zhang (Huawei, MAS Chair)"},{"$f":"VLOOKUP(D5,AllDocs!A:D,4,0)","v":"2017-09-18T09:40:43"},"Noted",{"$f":"VLOOKUP(D5,AllDocs!A:F,6,0)","v":"AG"}]
["Mon-3 (13:30-15:00)",{"$f":"VLOOKUP(A6,logistics!G:I,2,0)","v":1},{"$f":"VLOOKUP(A6,logistics!G:I,3,0)","v":"MAS "},"MAS-2017-0221",{"$f":"VLOOKUP(D6,AllDocs!A:D,2,0)","v":"semanticMashupInstance Resource Clarification"},{"$f":"VLOOKUP(D6,AllDocs!A:D,3,0)","v":"Convida"},{"$f":"VLOOKUP(D6,AllDocs!A:D,4,0)","v":"2017-09-11T01:37:46"},"Agreed",{"$f":"VLOOKUP(D6,AllDocs!A:F,6,0)","v":"CR"},"TS-0034 (WI-0053)",3]
["Mon-3 (13:30-15:00)",{"$f":"VLOOKUP(A7,logistics!G:I,2,0)","v":1},{"$f":"VLOOKUP(A7,logistics!G:I,3,0)","v":"MAS "},"MAS-2017-0222",{"$f":"VLOOKUP(D7,AllDocs!A:D,2,0)","v":"New WI on Industrial Domain Information Model"},{"$f":"VLOOKUP(D7,AllDocs!A:D,3,0)","v":"Hitachi"},{"$f":"VLOOKUP(D7,AllDocs!A:D,4,0)","v":"2017-09-11T01:48:20"},"Noted",{"$f":"VLOOKUP(D7,AllDocs!A:F,6,0)","v":"INC"},"Generic",4]
["Mon-3 (13:30-15:00)",{"$f":"VLOOKUP(A8,logistics!G:I,2,0)","v":1},{"$f":"VLOOKUP(A8,logistics!G:I,3,0)","v":"MAS "},"MAS-2017-0222R01",{"$f":"VLOOKUP(D8,AllDocs!A:D,2,0)","v":"New WI on Industrial Domain Information Model"},{"$f":"VLOOKUP(D8,AllDocs!A:D,3,0)","v":"Hitachi"},{"$f":"VLOOKUP(D8,AllDocs!A:D,4,0)","v":"2017-09-11T03:06:28"},"Noted",{"$f":"VLOOKUP(D8,AllDocs!A:F,6,0)","v":"INC"},"Generic",4]
["Mon-3 (13:30-15:00)",{"$f":"VLOOKUP(A9,logistics!G:I,2,0)","v":1},{"$f":"VLOOKUP(A9,logistics!G:I,3,0)","v":"MAS "},"MAS-2017-0222R02",{"$f":"VLOOKUP(D9,AllDocs!A:D,2,0)","v":"New WI on Industrial Domain Information Model"},{"$f":"VLOOKUP(D9,AllDocs!A:D,3,0)","v":"Hitachi"},{"$f":"VLOOKUP(D9,AllDocs!A:D,4,0)","v":"2017-09-18T05:26:26"},"Noted",{"$f":"VLOOKUP(D9,AllDocs!A:F,6,0)","v":"INC"},"Generic",4,null,"1. industrial information mmodels may be out of scope of oneM2M, rather in the scope of Industry 4.0. May need to change the name of the WI, not to misleading.\n2. two steps: mapping directly the inforamtion model to oneM2M, then add semantic features (e.g. annotation)\n3. to modify the WID and present to MAS before TP."]
["Mon-3 (13:30-15:00)",{"$f":"VLOOKUP(A10,logistics!G:I,2,0)","v":1},{"$f":"VLOOKUP(A10,logistics!G:I,3,0)","v":"MAS "},"MAS-2017-0223",{"$f":"VLOOKUP(D10,AllDocs!A:D,2,0)","v":"Adding support managing gallery device"},{"$f":"VLOOKUP(D10,AllDocs!A:D,3,0)","v":"BOE"},{"$f":"VLOOKUP(D10,AllDocs!A:D,4,0)","v":"2017-09-11T06:14:56"},"Noted",{"$f":"VLOOKUP(D10,AllDocs!A:F,6,0)","v":"CR"},"TS-0023 (WI-0056)",3,null,"Suggest to postpone to R4. (coordination with the rapporteur"]
["Mon-3 (13:30-15:00)",{"$f":"VLOOKUP(A11,logistics!G:I,2,0)","v":1},{"$f":"VLOOKUP(A11,logistics!G:I,3,0)","v":"MAS "},"MAS-2017-0226",{"$f":"VLOOKUP(D11,AllDocs!A:D,2,0)","v":"Added semantic check aspects in semantic validation"},{"$f":"VLOOKUP(D11,AllDocs!A:D,3,0)","v":"KT"},{"$f":"VLOOKUP(D11,AllDocs!A:D,4,0)","v":"2017-09-13T20:46:14"},"Noted",{"$f":"VLOOKUP(D11,AllDocs!A:F,6,0)","v":"CR"},"TS-0034 (WI-0053)",3]
["Mon-3 (13:30-15:00)",{"$f":"VLOOKUP(A12,logistics!G:I,2,0)","v":1},{"$f":"VLOOKUP(A12,logistics!G:I,3,0)","v":"MAS "},"MAS-2017-0226R01",{"$f":"VLOOKUP(D12,AllDocs!A:D,2,0)","v":"Added semantic check aspects in semantic validation"},{"$f":"VLOOKUP(D12,AllDocs!A:D,3,0)","v":"KT"},{"$f":"VLOOKUP(D12,AllDocs!A:D,4,0)","v":"2017-09-18T08:06:27"},"Noted",{"$f":"VLOOKUP(D12,AllDocs!A:F,6,0)","v":"CR"},"TS-0034 (WI-0053)",3,null,"R3 doesn't support validation of the Ontologies (classes)\nSuggest to remove Class validation, using a Note instead.\nFurther offline discussion needed.\nR02 expected."]
["Mon-3 (13:30-15:00)",{"$f":"VLOOKUP(A13,logistics!G:I,2,0)","v":1},{"$f":"VLOOKUP(A13,logistics!G:I,3,0)","v":"MAS "},"MAS-2017-0212R01",{"$f":"VLOOKUP(D13,AllDocs!A:D,2,0)","v":"HAIM_modification_for_cookerFood_model"},{"$f":"VLOOKUP(D13,AllDocs!A:D,3,0)","v":"Qualcomm Inc. (TIA)"},{"$f":"VLOOKUP(D13,AllDocs!A:D,4,0)","v":"2017-08-29T04:19:44"},"Agreed",{"$f":"VLOOKUP(D13,AllDocs!A:F,6,0)","v":"CR"},"TS-0023 (WI-0056)",3]
["Mon-5 (17:00-18:30)",{"$f":"VLOOKUP(A14,logistics!G:I,2,0)","v":3},{"$f":"VLOOKUP(A14,logistics!G:I,3,0)","v":"MAS-adhoc"},"MAS-2017-0199R02",{"$f":"VLOOKUP(D14,AllDocs!A:D,2,0)","v":"rewriting TS-0030-Generic-Interworking"},{"$f":"VLOOKUP(D14,AllDocs!A:D,3,0)","v":"NEC"},{"$f":"VLOOKUP(D14,AllDocs!A:D,4,0)","v":"2017-09-13T17:31:18"},null,{"$f":"VLOOKUP(D14,AllDocs!A:F,6,0)","v":"INC"},"TS-0030 (WI-0063)",3,null,"1. naming convention should be revised (regarding instance-numbering) using consistent patterns.\n2. SDT-based interworking and BO-based interworking are already aligned a lot and should be further aligned in the next release (ideally identical). \n3. revision expected."]
["Mon-5 (17:00-18:30)",{"$f":"VLOOKUP(A15,logistics!G:I,2,0)","v":3},{"$f":"VLOOKUP(A15,logistics!G:I,3,0)","v":"MAS-adhoc"},"MAS-2017-0200R01",{"$f":"VLOOKUP(D15,AllDocs!A:D,2,0)","v":"changes to TS-0012 due to rewriting TS-0030-Generic-Interworking"},{"$f":"VLOOKUP(D15,AllDocs!A:D,3,0)","v":"NEC"},{"$f":"VLOOKUP(D15,AllDocs!A:D,4,0)","v":"2017-09-08T19:02:29"},null,{"$f":"VLOOKUP(D15,AllDocs!A:F,6,0)","v":"INC"},"TS-0012 (WI-0063)",3,null,"the change has no impact to SAREF mapping"]
["Tue-1 (08:30-10:00)",{"$f":"VLOOKUP(A16,logistics!G:I,2,0)","v":1},{"$f":"VLOOKUP(A16,logistics!G:I,3,0)","v":"ARC/MAS"},"ARC-2017-0391",{"$f":"VLOOKUP(D16,AllDocs!A:D,2,0)","v":"modification of access mode for deviceInfo"},{"$f":"VLOOKUP(D16,AllDocs!A:D,3,0)","v":"NTT"},{"$f":"VLOOKUP(D16,AllDocs!A:D,4,0)","v":"2017-09-11T07:22:07"},"Noted",{"$f":"VLOOKUP(D16,AllDocs!A:F,6,0)","v":"INC"},"TS-0001 (WI-0002)",3,null,"the consensus is go with solution. corresponding CRs will come later."]
["Tue-1 (08:30-10:00)",{"$f":"VLOOKUP(A17,logistics!G:I,2,0)","v":1},{"$f":"VLOOKUP(A17,logistics!G:I,3,0)","v":"ARC/MAS"},"ARC-2017-0349",{"$f":"VLOOKUP(D17,AllDocs!A:D,2,0)","v":"TS-0001-mgmtObj_firmware_software_R3"},{"$f":"VLOOKUP(D17,AllDocs!A:D,3,0)","v":"C-DOT"},{"$f":"VLOOKUP(D17,AllDocs!A:D,4,0)","v":"2017-08-16T12:33:59"},"Noted",{"$f":"VLOOKUP(D17,AllDocs!A:F,6,0)","v":"CR"},"TS-0001 (WI-0002)",3,null,"KEEP status as mandatory, but change to RW for IPE case, and update TS-0004 providing initial status value.\nR01 expected in ARC."]
["Tue-1 (08:30-10:00)",{"$f":"VLOOKUP(A18,logistics!G:I,2,0)","v":1},{"$f":"VLOOKUP(A18,logistics!G:I,3,0)","v":"ARC/MAS"},"ARC-2017-0350",{"$f":"VLOOKUP(D18,AllDocs!A:D,2,0)","v":"TS-0001-mgmtObj_firmware_software_MIRROR_R2"},{"$f":"VLOOKUP(D18,AllDocs!A:D,3,0)","v":"C-DOT"},{"$f":"VLOOKUP(D18,AllDocs!A:D,4,0)","v":"2017-08-16T12:35:33"},"Noted",{"$f":"VLOOKUP(D18,AllDocs!A:F,6,0)","v":"CR"},"TS-0001 (WI-0002)",2,null,"KEEP status as mandatory, but change to RW for IPE case, and update TS-0004 providing initial status value.\nR01 expected in ARC."]
["Tue-1 (08:30-10:00)",{"$f":"VLOOKUP(A19,logistics!G:I,2,0)","v":1},{"$f":"VLOOKUP(A19,logistics!G:I,3,0)","v":"ARC/MAS"},"ARC-2017-0364",{"$f":"VLOOKUP(D19,AllDocs!A:D,2,0)","v":"Cleanup on Resource Types Table For Semantic Mashup Resources"},{"$f":"VLOOKUP(D19,AllDocs!A:D,3,0)","v":"Convida"},{"$f":"VLOOKUP(D19,AllDocs!A:D,4,0)","v":"2017-09-11T01:40:34"},"Agreed",{"$f":"VLOOKUP(D19,AllDocs!A:F,6,0)","v":"CR"},"TS-0001 (WI-0002)",3]
["Tue-1 (08:30-10:00)",{"$f":"VLOOKUP(A20,logistics!G:I,2,0)","v":1},{"$f":"VLOOKUP(A20,logistics!G:I,3,0)","v":"ARC/MAS"},"MAS-2017-0199R01",{"$f":"VLOOKUP(D20,AllDocs!A:D,2,0)","v":"rewriting TS-0030-Generic-Interworking"},{"$f":"VLOOKUP(D20,AllDocs!A:D,3,0)","v":"NEC"},{"$f":"VLOOKUP(D20,AllDocs!A:D,4,0)","v":"2017-09-08T18:48:17"},"Noted",{"$f":"VLOOKUP(D20,AllDocs!A:F,6,0)","v":"INC"},"TS-0030 (WI-0063)",3]
["Tue-1 (08:30-10:00)",{"$f":"VLOOKUP(A21,logistics!G:I,2,0)","v":1},{"$f":"VLOOKUP(A21,logistics!G:I,3,0)","v":"ARC/MAS"},"MAS-2017-0199R02",{"$f":"VLOOKUP(D21,AllDocs!A:D,2,0)","v":"rewriting TS-0030-Generic-Interworking"},{"$f":"VLOOKUP(D21,AllDocs!A:D,3,0)","v":"NEC"},{"$f":"VLOOKUP(D21,AllDocs!A:D,4,0)","v":"2017-09-13T17:31:18"},"Noted",{"$f":"VLOOKUP(D21,AllDocs!A:F,6,0)","v":"INC"},"TS-0030 (WI-0063)",3,null,"1. clarified the relationships between 'Proximal Interworking', 'Generic Interworking', 'HAIM interworking'。Suggestion is to rename TS-0030 'Generic interworking' to something around 'ontology-based interworking'. Also rename TS-0033 'Proximal Interworking' to 'Interworking Framework'.\n2. example will be given later in an annex to show the whole process.\nR03 expected in MAS."]
["Tue-2 (10:30-12:00)",{"$f":"VLOOKUP(A22,logistics!G:I,2,0)","v":2},{"$f":"VLOOKUP(A22,logistics!G:I,3,0)","v":"MAS "},"MAS-2017-0231",{"$f":"VLOOKUP(D22,AllDocs!A:D,2,0)","v":"HAIM_Mapping_OMA_DWAPI_3DP_data_type"},{"$f":"VLOOKUP(D22,AllDocs!A:D,3,0)","v":"ETRI, HERIT"},{"$f":"VLOOKUP(D22,AllDocs!A:D,4,0)","v":"2017-09-17T12:21:56"},"Noted",{"$f":"VLOOKUP(D22,AllDocs!A:F,6,0)","v":"CR"},"TS-0023 (WI-0056)",3,null,"detailed mapping description should go to clause 7.1.2 (0230R02)\nR01 expected."]
["Tue-2 (10:30-12:00)",{"$f":"VLOOKUP(A23,logistics!G:I,2,0)","v":2},{"$f":"VLOOKUP(A23,logistics!G:I,3,0)","v":"MAS "},"MAS-2017-0230",{"$f":"VLOOKUP(D23,AllDocs!A:D,2,0)","v":"HAIM_Mapping_OMA_DWAPI_3DP_dev_model"},{"$f":"VLOOKUP(D23,AllDocs!A:D,3,0)","v":"ETRI, HERIT"},{"$f":"VLOOKUP(D23,AllDocs!A:D,4,0)","v":"2017-09-17T12:22:14"},"Noted",{"$f":"VLOOKUP(D23,AllDocs!A:F,6,0)","v":"CR"},"TS-0023 (WI-0056)",3]
["Tue-2 (10:30-12:00)",{"$f":"VLOOKUP(A24,logistics!G:I,2,0)","v":2},{"$f":"VLOOKUP(A24,logistics!G:I,3,0)","v":"MAS "},"MAS-2017-0230R01",{"$f":"VLOOKUP(D24,AllDocs!A:D,2,0)","v":"HAIM_Mapping_OMA_DWAPI_3DP_dev_model"},{"$f":"VLOOKUP(D24,AllDocs!A:D,3,0)","v":"ETRI, HERIT"},{"$f":"VLOOKUP(D24,AllDocs!A:D,4,0)","v":"2017-09-19T05:15:17"},"Noted",{"$f":"VLOOKUP(D24,AllDocs!A:F,6,0)","v":"CR"},"TS-0023 (WI-0056)",3,null,"need to check the naming convention whether datapoint name can start with numbers.\nadd more meaningful description.\nR02 expected. "]
["Tue-2 (10:30-12:00)",{"$f":"VLOOKUP(A25,logistics!G:I,2,0)","v":2},{"$f":"VLOOKUP(A25,logistics!G:I,3,0)","v":"MAS "},"MAS-2017-0229",{"$f":"VLOOKUP(D25,AllDocs!A:D,2,0)","v":"HAIM_Mapping_OMA_DWAPI_introduction"},{"$f":"VLOOKUP(D25,AllDocs!A:D,3,0)","v":"ETRI, HERIT"},{"$f":"VLOOKUP(D25,AllDocs!A:D,4,0)","v":"2017-09-17T12:22:28"},"Noted",{"$f":"VLOOKUP(D25,AllDocs!A:F,6,0)","v":"CR"},"TS-0023 (WI-0056)",3,null,"to add reference and abbrievations for DWAPI & GotAPI.\nR01 expected."]
["Tue-2 (10:30-12:00)",{"$f":"VLOOKUP(A26,logistics!G:I,2,0)","v":2},{"$f":"VLOOKUP(A26,logistics!G:I,3,0)","v":"MAS "},"MAS-2017-0200R01",{"$f":"VLOOKUP(D26,AllDocs!A:D,2,0)","v":"changes to TS-0012 due to rewriting TS-0030-Generic-Interworking"},{"$f":"VLOOKUP(D26,AllDocs!A:D,3,0)","v":"NEC"},{"$f":"VLOOKUP(D26,AllDocs!A:D,4,0)","v":"2017-09-08T19:02:29"},"Noted",{"$f":"VLOOKUP(D26,AllDocs!A:F,6,0)","v":"INC"},"TS-0012 (WI-0063)",3]
["Tue-2 (10:30-12:00)",{"$f":"VLOOKUP(A27,logistics!G:I,2,0)","v":2},{"$f":"VLOOKUP(A27,logistics!G:I,3,0)","v":"MAS "},"MAS-2017-0200R02",{"$f":"VLOOKUP(D27,AllDocs!A:D,2,0)","v":"changes to TS-0012 due to rewriting TS-0030-Generic-Interworking"},{"$f":"VLOOKUP(D27,AllDocs!A:D,3,0)","v":"NEC"},{"$f":"VLOOKUP(D27,AllDocs!A:D,4,0)","v":"2017-09-19T05:53:00"},"Noted",{"$f":"VLOOKUP(D27,AllDocs!A:F,6,0)","v":"INC"},"TS-0012 (WI-0063)",3,null,"R03 expected to fix editorial issues."]
["Tue-3 (13:30-15:00)",{"$f":"VLOOKUP(A28,logistics!G:I,2,0)","v":2},{"$f":"VLOOKUP(A28,logistics!G:I,3,0)","v":"PRO/MAS"},"PRO-2017-0222",{"$f":"VLOOKUP(D28,AllDocs!A:D,2,0)","v":"ontologyRepository resource & procedures TS-0004 R3"},{"$f":"VLOOKUP(D28,AllDocs!A:D,3,0)","v":"Yongjing Zhang (Huawei)"},{"$f":"VLOOKUP(D28,AllDocs!A:D,4,0)","v":"2017-09-08T10:30:43"},"Noted",{"$f":"VLOOKUP(D28,AllDocs!A:F,6,0)","v":"CR"},"TS-0004 (WI-0009)",3]
["Tue-3 (13:30-15:00)",{"$f":"VLOOKUP(A29,logistics!G:I,2,0)","v":2},{"$f":"VLOOKUP(A29,logistics!G:I,3,0)","v":"PRO/MAS"},"PRO-2017-0222R01",{"$f":"VLOOKUP(D29,AllDocs!A:D,2,0)","v":"ontologyRepository resource & procedures TS-0004 R3"},{"$f":"VLOOKUP(D29,AllDocs!A:D,3,0)","v":"Yongjing Zhang (Huawei)"},{"$f":"VLOOKUP(D29,AllDocs!A:D,4,0)","v":"2017-09-19T06:08:32"},"Noted",{"$f":"VLOOKUP(D29,AllDocs!A:F,6,0)","v":"CR"},"TS-0004 (WI-0009)",3,null,"R02 expected"]
["Tue-3 (13:30-15:00)",{"$f":"VLOOKUP(A30,logistics!G:I,2,0)","v":2},{"$f":"VLOOKUP(A30,logistics!G:I,3,0)","v":"PRO/MAS"},"PRO-2017-0223",{"$f":"VLOOKUP(D30,AllDocs!A:D,2,0)","v":"ontology resource & procedures TS-0004 R3"},{"$f":"VLOOKUP(D30,AllDocs!A:D,3,0)","v":"Yongjing Zhang (Huawei)"},{"$f":"VLOOKUP(D30,AllDocs!A:D,4,0)","v":"2017-09-08T10:30:31"},"Noted",{"$f":"VLOOKUP(D30,AllDocs!A:F,6,0)","v":"CR"},"TS-0004 (WI-0009)",3,null,"R01 expected"]
["Tue-3 (13:30-15:00)",{"$f":"VLOOKUP(A31,logistics!G:I,2,0)","v":2},{"$f":"VLOOKUP(A31,logistics!G:I,3,0)","v":"PRO/MAS"},"PRO-2017-0224",{"$f":"VLOOKUP(D31,AllDocs!A:D,2,0)","v":"semanticValidation resource & procedures TS-0004 R3"},{"$f":"VLOOKUP(D31,AllDocs!A:D,3,0)","v":"Yongjing Zhang (Huawei)"},{"$f":"VLOOKUP(D31,AllDocs!A:D,4,0)","v":"2017-09-08T10:30:19"},"Noted",{"$f":"VLOOKUP(D31,AllDocs!A:F,6,0)","v":"CR"},"TS-0004 (WI-0009)",3,null,"R01 expected"]
["Tue-3 (13:30-15:00)",{"$f":"VLOOKUP(A32,logistics!G:I,2,0)","v":2},{"$f":"VLOOKUP(A32,logistics!G:I,3,0)","v":"PRO/MAS"},"PRO-2017-0225",{"$f":"VLOOKUP(D32,AllDocs!A:D,2,0)","v":"update to semanticDescriptor resource & procedure TS-0004 R3"},{"$f":"VLOOKUP(D32,AllDocs!A:D,3,0)","v":"Yongjing Zhang (Huawei)"},{"$f":"VLOOKUP(D32,AllDocs!A:D,4,0)","v":"2017-09-08T10:30:04"},"Noted",{"$f":"VLOOKUP(D32,AllDocs!A:F,6,0)","v":"CR"},"TS-0004 (WI-0009)",3,null,"R01 expected"]
["Tue-3 (13:30-15:00)",{"$f":"VLOOKUP(A33,logistics!G:I,2,0)","v":2},{"$f":"VLOOKUP(A33,logistics!G:I,3,0)","v":"PRO/MAS"},"PRO-2017-0233",{"$f":"VLOOKUP(D33,AllDocs!A:D,2,0)","v":"Semantic Query Support in TS-0004"},{"$f":"VLOOKUP(D33,AllDocs!A:D,3,0)","v":"Convida, NEC"},{"$f":"VLOOKUP(D33,AllDocs!A:D,4,0)","v":"2017-09-11T01:38:53"},"Noted",{"$f":"VLOOKUP(D33,AllDocs!A:F,6,0)","v":"CR"},"TS-0004 (WI-0009)",3,null,"R01 expected"]
["Tue-4 (15:30-17:00)",{"$f":"VLOOKUP(A34,logistics!G:I,2,0)","v":3},{"$f":"VLOOKUP(A34,logistics!G:I,3,0)","v":"MAS-adhoc"},"MAS-2017-0226R02",{"$f":"VLOOKUP(D34,AllDocs!A:D,2,0)","v":"Added semantic check aspects in semantic validation"},{"$f":"VLOOKUP(D34,AllDocs!A:D,3,0)","v":"KT"},{"$f":"VLOOKUP(D34,AllDocs!A:D,4,0)","v":"2017-09-19T11:07:34"},null,{"$f":"VLOOKUP(D34,AllDocs!A:F,6,0)","v":"CR"},"TS-0034 (WI-0053)",3]
["Tue-4 (15:30-17:00)",{"$f":"VLOOKUP(A35,logistics!G:I,2,0)","v":3},{"$f":"VLOOKUP(A35,logistics!G:I,3,0)","v":"MAS-adhoc"},"TP-2017-0260R03",{"$f":"VLOOKUP(D35,AllDocs!A:D,2,0)","v":"New WI on Industrial Domain Information Model"},{"$f":"VLOOKUP(D35,AllDocs!A:D,3,0)","v":"Hitachi"},{"$f":"VLOOKUP(D35,AllDocs!A:D,4,0)","v":"2017-09-19T09:36:14"},null,{"$f":"VLOOKUP(D35,AllDocs!A:F,6,0)","v":"INC"},null,null,null,"Hans (DT) will provide additional text in the WID implying that oneM2M may provide added value to harmonize/coordinate/integrate the different existing industrial information models.\nWe should also look at other publically available use cases. Hans can provide references.\nAfter online editing, R04 will be submitted to TP."]
["Tue-5 (17:00-18:30)",{"$f":"VLOOKUP(A36,logistics!G:I,2,0)","v":2},{"$f":"VLOOKUP(A36,logistics!G:I,3,0)","v":"PRO/MAS"},"PRO-2017-0234",{"$f":"VLOOKUP(D36,AllDocs!A:D,2,0)","v":"Semantic Content Support in TS-0004"},{"$f":"VLOOKUP(D36,AllDocs!A:D,3,0)","v":"Convida, NEC"},{"$f":"VLOOKUP(D36,AllDocs!A:D,4,0)","v":"2017-09-11T01:38:38"},"Noted",{"$f":"VLOOKUP(D36,AllDocs!A:F,6,0)","v":"CR"},"TS-0004 (WI-0009)",3,null,"Concerns from PRO:\n1. no way to turn off the duplication is not scalable. \n2. depending on the honesty to set the value of the duplicatoin flag is not a good design.\n3. allowing for update of <contentInstance> only for this case exceptionally is not a good design.\n\nThese concerns will be brought back to ARC/PRO for further discussion."]
["Tue-5 (17:00-18:30)",{"$f":"VLOOKUP(A37,logistics!G:I,2,0)","v":2},{"$f":"VLOOKUP(A37,logistics!G:I,3,0)","v":"PRO/MAS"},"PRO-2017-0235",{"$f":"VLOOKUP(D37,AllDocs!A:D,2,0)","v":"Semantic Mashup in TS-0004"},{"$f":"VLOOKUP(D37,AllDocs!A:D,3,0)","v":"Convida"},{"$f":"VLOOKUP(D37,AllDocs!A:D,4,0)","v":"2017-09-11T01:38:16"},"Noted",{"$f":"VLOOKUP(D37,AllDocs!A:F,6,0)","v":"CR"},"TS-0004 (WI-0009)",3]
["Thu-2 (10:30-12:00)",{"$f":"VLOOKUP(A38,logistics!G:I,2,0)","v":2},{"$f":"VLOOKUP(A38,logistics!G:I,3,0)","v":"MAS "},"MAS-2017-0199R03",{"$f":"VLOOKUP(D38,AllDocs!A:D,2,0)","v":"rewriting TS-0030-Generic-Interworking"},{"$f":"VLOOKUP(D38,AllDocs!A:D,3,0)","v":"NEC"},{"$f":"VLOOKUP(D38,AllDocs!A:D,4,0)","v":"2017-09-19T10:32:04"},"Noted",{"$f":"VLOOKUP(D38,AllDocs!A:F,6,0)","v":"INC"},"TS-0030 (WI-0063)",3,null,"need further consistency check.\nR04 expected."]
["Thu-2 (10:30-12:00)",{"$f":"VLOOKUP(A39,logistics!G:I,2,0)","v":2},{"$f":"VLOOKUP(A39,logistics!G:I,3,0)","v":"MAS "},"MAS-2017-0199R04",{"$f":"VLOOKUP(D39,AllDocs!A:D,2,0)","v":"rewriting TS-0030-Generic-Interworking"},{"$f":"VLOOKUP(D39,AllDocs!A:D,3,0)","v":"NEC"},{"$f":"VLOOKUP(D39,AllDocs!A:D,4,0)","v":"2017-09-21T06:08:39"},"Agreed",{"$f":"VLOOKUP(D39,AllDocs!A:F,6,0)","v":"INC"},"TS-0030 (WI-0063)",3]
["Thu-2 (10:30-12:00)",{"$f":"VLOOKUP(A40,logistics!G:I,2,0)","v":2},{"$f":"VLOOKUP(A40,logistics!G:I,3,0)","v":"MAS "},"MAS-2017-0200R03",{"$f":"VLOOKUP(D40,AllDocs!A:D,2,0)","v":"changes to TS-0012 due to rewriting TS-0030-Generic-Interworking"},{"$f":"VLOOKUP(D40,AllDocs!A:D,3,0)","v":"NEC"},{"$f":"VLOOKUP(D40,AllDocs!A:D,4,0)","v":"2017-09-19T07:45:50"},"Agreed",{"$f":"VLOOKUP(D40,AllDocs!A:F,6,0)","v":"INC"},"TS-0012 (WI-0063)",3]
["Thu-2 (10:30-12:00)",{"$f":"VLOOKUP(A41,logistics!G:I,2,0)","v":2},{"$f":"VLOOKUP(A41,logistics!G:I,3,0)","v":"MAS "},"MAS-2017-0232",{"$f":"VLOOKUP(D41,AllDocs!A:D,2,0)","v":"WI-0063 update and rename to Ontology based Interworking"},{"$f":"VLOOKUP(D41,AllDocs!A:D,3,0)","v":"NEC"},{"$f":"VLOOKUP(D41,AllDocs!A:D,4,0)","v":"2017-09-20T05:02:32"},"Noted",{"$f":"VLOOKUP(D41,AllDocs!A:F,6,0)","v":"INC"},"TS-0030 (WI-0063)",3,null,"a revision shall be submitted to TP for approval."]
["Thu-2 (10:30-12:00)",{"$f":"VLOOKUP(A42,logistics!G:I,2,0)","v":2},{"$f":"VLOOKUP(A42,logistics!G:I,3,0)","v":"MAS "},"MAS-2017-0229R01",{"$f":"VLOOKUP(D42,AllDocs!A:D,2,0)","v":"HAIM_Mapping_OMA_DWAPI_introduction"},{"$f":"VLOOKUP(D42,AllDocs!A:D,3,0)","v":"ETRI, HERIT"},{"$f":"VLOOKUP(D42,AllDocs!A:D,4,0)","v":"2017-09-21T04:23:06"},"Noted",{"$f":"VLOOKUP(D42,AllDocs!A:F,6,0)","v":"CR"},"TS-0023 (WI-0056)",3,null,"R02 expected"]
["Thu-2 (10:30-12:00)",{"$f":"VLOOKUP(A43,logistics!G:I,2,0)","v":2},{"$f":"VLOOKUP(A43,logistics!G:I,3,0)","v":"MAS "},"MAS-2017-0229R02",{"$f":"VLOOKUP(D43,AllDocs!A:D,2,0)","v":"HAIM_Mapping_OMA_DWAPI_introduction"},{"$f":"VLOOKUP(D43,AllDocs!A:D,3,0)","v":"ETRI, HERIT"},{"$f":"VLOOKUP(D43,AllDocs!A:D,4,0)","v":"2017-09-21T06:03:12"},"Noted",{"$f":"VLOOKUP(D43,AllDocs!A:F,6,0)","v":"CR"},"TS-0023 (WI-0056)",3]
["Thu-2 (10:30-12:00)",{"$f":"VLOOKUP(A44,logistics!G:I,2,0)","v":2},{"$f":"VLOOKUP(A44,logistics!G:I,3,0)","v":"MAS "},"MAS-2017-0229R03",{"$f":"VLOOKUP(D44,AllDocs!A:D,2,0)","v":"HAIM_Mapping_OMA_DWAPI_introduction"},{"$f":"VLOOKUP(D44,AllDocs!A:D,3,0)","v":"ETRI, HERIT"},{"$f":"VLOOKUP(D44,AllDocs!A:D,4,0)","v":"2017-09-21T06:16:18"},"Agreed",{"$f":"VLOOKUP(D44,AllDocs!A:F,6,0)","v":"CR"},"TS-0023 (WI-0056)",3]
["Thu-2 (10:30-12:00)",{"$f":"VLOOKUP(A45,logistics!G:I,2,0)","v":2},{"$f":"VLOOKUP(A45,logistics!G:I,3,0)","v":"MAS "},"MAS-2017-0230R02",{"$f":"VLOOKUP(D45,AllDocs!A:D,2,0)","v":"HAIM_Mapping_OMA_DWAPI_3DP_dev_model"},{"$f":"VLOOKUP(D45,AllDocs!A:D,3,0)","v":"ETRI, HERIT"},{"$f":"VLOOKUP(D45,AllDocs!A:D,4,0)","v":"2017-09-21T05:30:29"},"Agreed",{"$f":"VLOOKUP(D45,AllDocs!A:F,6,0)","v":"CR"},"TS-0023 (WI-0056)",3,null,"still need to check the naming convension about starting with numbers."]
["Thu-2 (10:30-12:00)",{"$f":"VLOOKUP(A46,logistics!G:I,2,0)","v":2},{"$f":"VLOOKUP(A46,logistics!G:I,3,0)","v":"MAS "},"MAS-2017-0231R01",{"$f":"VLOOKUP(D46,AllDocs!A:D,2,0)","v":"HAIM_Mapping_OMA_DWAPI_3DP_data_type"},{"$f":"VLOOKUP(D46,AllDocs!A:D,3,0)","v":"ETRI, HERIT"},{"$f":"VLOOKUP(D46,AllDocs!A:D,4,0)","v":"2017-09-21T05:30:07"},"Agreed",{"$f":"VLOOKUP(D46,AllDocs!A:F,6,0)","v":"CR"},"TS-0023 (WI-0056)",3]
["Thu-2 (10:30-12:00)",{"$f":"VLOOKUP(A47,logistics!G:I,2,0)","v":2},{"$f":"VLOOKUP(A47,logistics!G:I,3,0)","v":"MAS "},"MAS-2017-0226R02",{"$f":"VLOOKUP(D47,AllDocs!A:D,2,0)","v":"Added semantic check aspects in semantic validation"},{"$f":"VLOOKUP(D47,AllDocs!A:D,3,0)","v":"KT"},{"$f":"VLOOKUP(D47,AllDocs!A:D,4,0)","v":"2017-09-19T11:07:34"},"Noted",{"$f":"VLOOKUP(D47,AllDocs!A:F,6,0)","v":"CR"},"TS-0034 (WI-0053)",3]
["Thu-2 (10:30-12:00)",{"$f":"VLOOKUP(A48,logistics!G:I,2,0)","v":2},{"$f":"VLOOKUP(A48,logistics!G:I,3,0)","v":"MAS "},"MAS-2017-0226R03",{"$f":"VLOOKUP(D48,AllDocs!A:D,2,0)","v":"Added semantic check aspects in semantic validation"},{"$f":"VLOOKUP(D48,AllDocs!A:D,3,0)","v":"KT"},{"$f":"VLOOKUP(D48,AllDocs!A:D,4,0)","v":"2017-09-21T06:31:38"},"Agreed",{"$f":"VLOOKUP(D48,AllDocs!A:F,6,0)","v":"CR"},"TS-0034 (WI-0053)",3]
["Thu-2 (10:30-12:00)",{"$f":"VLOOKUP(A49,logistics!G:I,2,0)","v":2},{"$f":"VLOOKUP(A49,logistics!G:I,3,0)","v":"MAS "},"TP-2017-0278",{"$f":"VLOOKUP(D49,AllDocs!A:D,2,0)","v":"Reply LS to Broadband Forum on USP"},{"$f":"VLOOKUP(D49,AllDocs!A:D,3,0)","v":"Timothy Carey, Nokia"},{"$f":"VLOOKUP(D49,AllDocs!A:D,4,0)","v":"2017-09-21T02:52:55"},"Noted",{"$f":"VLOOKUP(D49,AllDocs!A:F,6,0)","v":"LS"},"Generic",null,null,"R01 to be submitted to TP for approval. Conf-call dates may need to update."]
["Thu-2 (10:30-12:00)",{"$f":"VLOOKUP(A50,logistics!G:I,2,0)","v":2},{"$f":"VLOOKUP(A50,logistics!G:I,3,0)","v":"MAS "},"TP-2017-0260R05",{"$f":"VLOOKUP(D50,AllDocs!A:D,2,0)","v":"New WI on Industrial Domain Information Model"},{"$f":"VLOOKUP(D50,AllDocs!A:D,3,0)","v":"Hitachi"},{"$f":"VLOOKUP(D50,AllDocs!A:D,4,0)","v":"2017-09-21T03:20:04"},"Noted",{"$f":"VLOOKUP(D50,AllDocs!A:F,6,0)","v":"INC"},null,null,null,"R06 to be submitted to TP for approval."]
["Thu-3 (13:30-15:00)",{"$f":"VLOOKUP(A51,logistics!G:I,2,0)","v":2},{"$f":"VLOOKUP(A51,logistics!G:I,3,0)","v":"TST/MAS"},"TST-2017-0228",{"$f":"VLOOKUP(D51,AllDocs!A:D,2,0)","v":"semanticInterop-R2"},{"$f":"VLOOKUP(D51,AllDocs!A:D,3,0)","v":"Convida"},{"$f":"VLOOKUP(D51,AllDocs!A:D,4,0)","v":"2017-09-11T20:17:51"},"Agreed",{"$f":"VLOOKUP(D51,AllDocs!A:F,6,0)","v":"CR"},"TS-0013 (WI-0060)",2]
["Thu-3 (13:30-15:00)",{"$f":"VLOOKUP(A52,logistics!G:I,2,0)","v":2},{"$f":"VLOOKUP(A52,logistics!G:I,3,0)","v":"TST/MAS"},"TST-2017-0240",{"$f":"VLOOKUP(D52,AllDocs!A:D,2,0)","v":"semantic_testing_proposal"},{"$f":"VLOOKUP(D52,AllDocs!A:D,3,0)","v":"Easy Global Market"},{"$f":"VLOOKUP(D52,AllDocs!A:D,4,0)","v":"2017-09-19T09:41:44"},"Noted",{"$f":"VLOOKUP(D52,AllDocs!A:F,6,0)","v":"INC"},"Generic",null,null,"may reuse ETSI SAREF test tools.\nsuggest to use Base Ontology as the base for testing."]
["Thu-3 (13:30-15:00)",{"$f":"VLOOKUP(A53,logistics!G:I,2,0)","v":2},{"$f":"VLOOKUP(A53,logistics!G:I,3,0)","v":"TST/MAS"},"TST-2017-0232",{"$f":"VLOOKUP(D53,AllDocs!A:D,2,0)","v":"Final corrections of SDT-IPE DvprGuide"},{"$f":"VLOOKUP(D53,AllDocs!A:D,3,0)","v":"Maciej Goluch (Orange)"},{"$f":"VLOOKUP(D53,AllDocs!A:D,4,0)","v":"2017-09-13T09:56:14"},"Noted",{"$f":"VLOOKUP(D53,AllDocs!A:F,6,0)","v":"CR"},"TR-0039 (WI-0054)",3]
["Thu-3 (13:30-15:00)",{"$f":"VLOOKUP(A54,logistics!G:I,2,0)","v":2},{"$f":"VLOOKUP(A54,logistics!G:I,3,0)","v":"TST/MAS"},"TST-2017-0232R01",{"$f":"VLOOKUP(D54,AllDocs!A:D,2,0)","v":"Final corrections of SDT-IPE DvprGuide"},{"$f":"VLOOKUP(D54,AllDocs!A:D,3,0)","v":"Maciej Goluch (Orange)"},{"$f":"VLOOKUP(D54,AllDocs!A:D,4,0)","v":"2017-09-18T12:28:14"},"Agreed",{"$f":"VLOOKUP(D54,AllDocs!A:F,6,0)","v":"CR"},"TR-0039 (WI-0054)",3]
["Thu-3 (13:30-15:00)",{"$f":"VLOOKUP(A55,logistics!G:I,2,0)","v":2},{"$f":"VLOOKUP(A55,logistics!G:I,3,0)","v":"TST/MAS"},"TST-2017-0234",{"$f":"VLOOKUP(D55,AllDocs!A:D,2,0)","v":"Added_missing_descriptorRepresentation_attribute_in_TR-0045"},{"$f":"VLOOKUP(D55,AllDocs!A:D,3,0)","v":"NEC"},{"$f":"VLOOKUP(D55,AllDocs!A:D,4,0)","v":"2017-09-13T14:28:03"},"Noted",{"$f":"VLOOKUP(D55,AllDocs!A:F,6,0)","v":"CR"},"TR-0045 (WI-0054)",3]
["Thu-3 (13:30-15:00)",{"$f":"VLOOKUP(A56,logistics!G:I,2,0)","v":2},{"$f":"VLOOKUP(A56,logistics!G:I,3,0)","v":"TST/MAS"},"TST-2017-0234R04",{"$f":"VLOOKUP(D56,AllDocs!A:D,2,0)","v":"Added_missing_descriptorRepresentation_attribute_in_TR-0045"},{"$f":"VLOOKUP(D56,AllDocs!A:D,3,0)","v":"NEC (Convida)"},{"$f":"VLOOKUP(D56,AllDocs!A:D,4,0)","v":"2017-09-21T03:56:59"},"Agreed",{"$f":"VLOOKUP(D56,AllDocs!A:F,6,0)","v":"CR"},"TR-0045 (WI-0054)",3]
["Thu-3 (13:30-15:00)",{"$f":"VLOOKUP(A57,logistics!G:I,2,0)","v":2},{"$f":"VLOOKUP(A57,logistics!G:I,3,0)","v":"TST/MAS"},"TST-2017-0241",{"$f":"VLOOKUP(D57,AllDocs!A:D,2,0)","v":"TR-0039 Baseline v0.0.5 after TST31"},{"$f":"VLOOKUP(D57,AllDocs!A:D,3,0)","v":"Maciej Goluch (Orange)"},{"$f":"VLOOKUP(D57,AllDocs!A:D,4,0)","v":"2017-09-21T08:01:07"},"Agreed",{"$f":"VLOOKUP(D57,AllDocs!A:F,6,0)","v":"CR"},"TR-0039 (WI-0054)",3]
["Thu-3 (13:30-15:00)",{"$f":"VLOOKUP(A58,logistics!G:I,2,0)","v":2},{"$f":"VLOOKUP(A58,logistics!G:I,3,0)","v":"TST/MAS"},"TST-2017-0243",{"$f":"VLOOKUP(D58,AllDocs!A:D,2,0)","v":"TR-0045_Baseline_v0.3.1"},{"$f":"VLOOKUP(D58,AllDocs!A:D,3,0)","v":"NEC"},{"$f":"VLOOKUP(D58,AllDocs!A:D,4,0)","v":"2017-09-21T05:06:49"},"Agreed",{"$f":"VLOOKUP(D58,AllDocs!A:F,6,0)","v":"INC"},"TR-0045 (WI-0054)",3]
["Thu-5 (17:00-18:30)",{"$f":"VLOOKUP(A59,logistics!G:I,2,0)","v":1},{"$f":"VLOOKUP(A59,logistics!G:I,3,0)","v":"PRO/MAS"},"<revisions>",{"$f":"VLOOKUP(D59,AllDocs!A:D,2,0)","v":{"$error":"#N/A"}},{"$f":"VLOOKUP(D59,AllDocs!A:D,3,0)","v":{"$error":"#N/A"}},{"$f":"VLOOKUP(D59,AllDocs!A:D,4,0)","v":{"$error":"#N/A"}},null,{"$f":"VLOOKUP(D59,AllDocs!A:F,6,0)","v":{"$error":"#N/A"}}]
["Thu-5 (17:00-18:30)",{"$f":"VLOOKUP(A60,logistics!G:I,2,0)","v":1},{"$f":"VLOOKUP(A60,logistics!G:I,3,0)","v":"PRO/MAS"},"PRO-2017-0222R02",{"$f":"VLOOKUP(D60,AllDocs!A:D,2,0)","v":"ontologyRepository resource & procedures TS-0004 R3"},{"$f":"VLOOKUP(D60,AllDocs!A:D,3,0)","v":"Yongjing Zhang (Huawei)"},{"$f":"VLOOKUP(D60,AllDocs!A:D,4,0)","v":"2017-09-19T16:18:09"},"Agreed",{"$f":"VLOOKUP(D60,AllDocs!A:F,6,0)","v":"CR"},"TS-0004 (WI-0009)",3]
["Thu-5 (17:00-18:30)",{"$f":"VLOOKUP(A61,logistics!G:I,2,0)","v":1},{"$f":"VLOOKUP(A61,logistics!G:I,3,0)","v":"PRO/MAS"},"PRO-2017-0223R01",{"$f":"VLOOKUP(D61,AllDocs!A:D,2,0)","v":"ontology resource & procedures TS-0004 R3"},{"$f":"VLOOKUP(D61,AllDocs!A:D,3,0)","v":"Yongjing Zhang (Huawei)"},{"$f":"VLOOKUP(D61,AllDocs!A:D,4,0)","v":"2017-09-19T16:18:50"},"Noted",{"$f":"VLOOKUP(D61,AllDocs!A:F,6,0)","v":"CR"},"TS-0004 (WI-0009)",3]
["Thu-5 (17:00-18:30)",{"$f":"VLOOKUP(A62,logistics!G:I,2,0)","v":1},{"$f":"VLOOKUP(A62,logistics!G:I,3,0)","v":"PRO/MAS"},"PRO-2017-0223R02",{"$f":"VLOOKUP(D62,AllDocs!A:D,2,0)","v":"ontology resource & procedures TS-0004 R3"},{"$f":"VLOOKUP(D62,AllDocs!A:D,3,0)","v":"Yongjing Zhang (Huawei)"},{"$f":"VLOOKUP(D62,AllDocs!A:D,4,0)","v":"2017-09-21T12:12:47"},"Agreed",{"$f":"VLOOKUP(D62,AllDocs!A:F,6,0)","v":"CR"},"TS-0004 (WI-0009)",3]
["Thu-5 (17:00-18:30)",{"$f":"VLOOKUP(A63,logistics!G:I,2,0)","v":1},{"$f":"VLOOKUP(A63,logistics!G:I,3,0)","v":"PRO/MAS"},"PRO-2017-0224R01",{"$f":"VLOOKUP(D63,AllDocs!A:D,2,0)","v":"semanticValidation resource & procedures TS-0004 R3"},{"$f":"VLOOKUP(D63,AllDocs!A:D,3,0)","v":"Yongjing Zhang (Huawei)"},{"$f":"VLOOKUP(D63,AllDocs!A:D,4,0)","v":"2017-09-19T16:19:18"},"Agreed",{"$f":"VLOOKUP(D63,AllDocs!A:F,6,0)","v":"CR"},"TS-0004 (WI-0009)",3]
["Thu-5 (17:00-18:30)",{"$f":"VLOOKUP(A64,logistics!G:I,2,0)","v":1},{"$f":"VLOOKUP(A64,logistics!G:I,3,0)","v":"PRO/MAS"},"PRO-2017-0225R01",{"$f":"VLOOKUP(D64,AllDocs!A:D,2,0)","v":"update to semanticDescriptor resource & procedure TS-0004 R3"},{"$f":"VLOOKUP(D64,AllDocs!A:D,3,0)","v":"Yongjing Zhang (Huawei)"},{"$f":"VLOOKUP(D64,AllDocs!A:D,4,0)","v":"2017-09-19T16:19:43"},"Noted",{"$f":"VLOOKUP(D64,AllDocs!A:F,6,0)","v":"CR"},"TS-0004 (WI-0009)",3]
["Thu-5 (17:00-18:30)",{"$f":"VLOOKUP(A65,logistics!G:I,2,0)","v":1},{"$f":"VLOOKUP(A65,logistics!G:I,3,0)","v":"PRO/MAS"},"PRO-2017-0225R02",{"$f":"VLOOKUP(D65,AllDocs!A:D,2,0)","v":"update to semanticDescriptor resource & procedure TS-0004 R3"},{"$f":"VLOOKUP(D65,AllDocs!A:D,3,0)","v":"Yongjing Zhang (Huawei)"},{"$f":"VLOOKUP(D65,AllDocs!A:D,4,0)","v":"2017-09-21T12:09:11"},"Agreed",{"$f":"VLOOKUP(D65,AllDocs!A:F,6,0)","v":"CR"},"TS-0004 (WI-0009)",3]
["Thu-5 (17:00-18:30)",{"$f":"VLOOKUP(A66,logistics!G:I,2,0)","v":1},{"$f":"VLOOKUP(A66,logistics!G:I,3,0)","v":"PRO/MAS"},"PRO-2017-0233R01",{"$f":"VLOOKUP(D66,AllDocs!A:D,2,0)","v":"Semantic Query Support in TS-0004"},{"$f":"VLOOKUP(D66,AllDocs!A:D,3,0)","v":"Convida, NEC"},{"$f":"VLOOKUP(D66,AllDocs!A:D,4,0)","v":"2017-09-20T11:44:35"},"Agreed",{"$f":"VLOOKUP(D66,AllDocs!A:F,6,0)","v":"CR"},"TS-0004 (WI-0009)",3]
["Thu-5 (17:00-18:30)",{"$f":"VLOOKUP(A67,logistics!G:I,2,0)","v":1},{"$f":"VLOOKUP(A67,logistics!G:I,3,0)","v":"PRO/MAS"},"PRO-2017-0235R01",{"$f":"VLOOKUP(D67,AllDocs!A:D,2,0)","v":"Semantic Mashup in TS-0004"},{"$f":"VLOOKUP(D67,AllDocs!A:D,3,0)","v":"Convida"},{"$f":"VLOOKUP(D67,AllDocs!A:D,4,0)","v":"2017-09-20T11:45:28"},"Noted",{"$f":"VLOOKUP(D67,AllDocs!A:F,6,0)","v":"CR"},"TS-0004 (WI-0009)",3]
["Thu-5 (17:00-18:30)",{"$f":"VLOOKUP(A68,logistics!G:I,2,0)","v":1},{"$f":"VLOOKUP(A68,logistics!G:I,3,0)","v":"PRO/MAS"},"PRO-2017-0235R02",{"$f":"VLOOKUP(D68,AllDocs!A:D,2,0)","v":{"$error":"#N/A"}},{"$f":"VLOOKUP(D68,AllDocs!A:D,3,0)","v":{"$error":"#N/A"}},{"$f":"VLOOKUP(D68,AllDocs!A:D,4,0)","v":{"$error":"#N/A"}},"Agreed",{"$f":"VLOOKUP(D68,AllDocs!A:F,6,0)","v":{"$error":"#N/A"}},"TS-0004 (WI-0009)",3]
["Thu-5 (17:00-18:30)",{"$f":"VLOOKUP(A69,logistics!G:I,2,0)","v":1},{"$f":"VLOOKUP(A69,logistics!G:I,3,0)","v":"PRO/MAS"},"PRO-2017-0227",{"$f":"VLOOKUP(D69,AllDocs!A:D,2,0)","v":"mgmtCmd_update(normal)_R3"},{"$f":"VLOOKUP(D69,AllDocs!A:D,3,0)","v":"C-DOT"},{"$f":"VLOOKUP(D69,AllDocs!A:D,4,0)","v":"2017-09-08T06:50:25"},"Noted",{"$f":"VLOOKUP(D69,AllDocs!A:F,6,0)","v":"CR"},"TS-0004 (WI-0009)",3]
["Thu-5 (17:00-18:30)",{"$f":"VLOOKUP(A70,logistics!G:I,2,0)","v":1},{"$f":"VLOOKUP(A70,logistics!G:I,3,0)","v":"PRO/MAS"},"PRO-2017-0227R01",{"$f":"VLOOKUP(D70,AllDocs!A:D,2,0)","v":"mgmtCmd_update(normal)_R3"},{"$f":"VLOOKUP(D70,AllDocs!A:D,3,0)","v":"C-DOT"},{"$f":"VLOOKUP(D70,AllDocs!A:D,4,0)","v":"2017-09-21T12:07:20"},"Agreed",{"$f":"VLOOKUP(D70,AllDocs!A:F,6,0)","v":"CR"},"TS-0004 (WI-0009)",3]
["Thu-5 (17:00-18:30)",{"$f":"VLOOKUP(A71,logistics!G:I,2,0)","v":1},{"$f":"VLOOKUP(A71,logistics!G:I,3,0)","v":"PRO/MAS"},"PRO-2017-0274",{"$f":"VLOOKUP(D71,AllDocs!A:D,2,0)","v":"mgmtCmd_update(normal)_R2"},{"$f":"VLOOKUP(D71,AllDocs!A:D,3,0)","v":"C-DOT"},{"$f":"VLOOKUP(D71,AllDocs!A:D,4,0)","v":"2017-09-16T13:26:23"},"Noted",{"$f":"VLOOKUP(D71,AllDocs!A:F,6,0)","v":"CR"}]
["Thu-5 (17:00-18:30)",{"$f":"VLOOKUP(A72,logistics!G:I,2,0)","v":1},{"$f":"VLOOKUP(A72,logistics!G:I,3,0)","v":"PRO/MAS"},"PRO-2017-0274R01",{"$f":"VLOOKUP(D72,AllDocs!A:D,2,0)","v":"mgmtCmd_update(normal)_R2"},{"$f":"VLOOKUP(D72,AllDocs!A:D,3,0)","v":"C-DOT"},{"$f":"VLOOKUP(D72,AllDocs!A:D,4,0)","v":"2017-09-21T12:23:27"},"Agreed",{"$f":"VLOOKUP(D72,AllDocs!A:F,6,0)","v":"CR"}]
["Thu-5 (17:00-18:30)",{"$f":"VLOOKUP(A73,logistics!G:I,2,0)","v":1},{"$f":"VLOOKUP(A73,logistics!G:I,3,0)","v":"PRO/MAS"},"MAS-2017-0227",{"$f":"VLOOKUP(D73,AllDocs!A:D,2,0)","v":"TS-0006-mgmtCmd_execResult(R3)"},{"$f":"VLOOKUP(D73,AllDocs!A:D,3,0)","v":"C-DOT"},{"$f":"VLOOKUP(D73,AllDocs!A:D,4,0)","v":"2017-09-14T11:43:08"},"Agreed",{"$f":"VLOOKUP(D73,AllDocs!A:F,6,0)","v":"CR"},"TS-0006 (WI-0010)",3]
["Thu-5 (17:00-18:30)",{"$f":"VLOOKUP(A74,logistics!G:I,2,0)","v":1},{"$f":"VLOOKUP(A74,logistics!G:I,3,0)","v":"PRO/MAS"},"MAS-2017-0228",{"$f":"VLOOKUP(D74,AllDocs!A:D,2,0)","v":"TS-0006-mgmtCmd_execResult(R2)"},{"$f":"VLOOKUP(D74,AllDocs!A:D,3,0)","v":"C-DOT"},{"$f":"VLOOKUP(D74,AllDocs!A:D,4,0)","v":"2017-09-14T11:44:57"},"Agreed",{"$f":"VLOOKUP(D74,AllDocs!A:F,6,0)","v":"CR"},"TS-0006 (WI-0010)",2]
["Thu-5 (17:00-18:30)",{"$f":"VLOOKUP(A75,logistics!G:I,2,0)","v":1},{"$f":"VLOOKUP(A75,logistics!G:I,3,0)","v":"PRO/MAS"},"PRO-2017-0191",{"$f":"VLOOKUP(D75,AllDocs!A:D,2,0)","v":"deviceInfo_attributes_R3"},{"$f":"VLOOKUP(D75,AllDocs!A:D,3,0)","v":"C-DOT"},{"$f":"VLOOKUP(D75,AllDocs!A:D,4,0)","v":"2017-08-08T12:06:41"},"Noted",{"$f":"VLOOKUP(D75,AllDocs!A:F,6,0)","v":"CR"},"TS-0004 (WI-0009)",3,null,"manufacturingDate shall be absolute time.\nsystemTime \nURL type xs:anyURL\nconsistency shall be aligned with ARC TS-0001 first"]
["Thu-5 (17:00-18:30)",{"$f":"VLOOKUP(A76,logistics!G:I,2,0)","v":1},{"$f":"VLOOKUP(A76,logistics!G:I,3,0)","v":"PRO/MAS"},"PRO-2017-0201",{"$f":"VLOOKUP(D76,AllDocs!A:D,2,0)","v":"mgmtObj_update"},{"$f":"VLOOKUP(D76,AllDocs!A:D,3,0)","v":"C-DOT"},{"$f":"VLOOKUP(D76,AllDocs!A:D,4,0)","v":"2017-09-05T09:37:07"},"Noted",{"$f":"VLOOKUP(D76,AllDocs!A:F,6,0)","v":"CR"},"TS-0004 (WI-0009)",3,null,"R01 expected."]
["Thu-5 (17:00-18:30)",{"$f":"VLOOKUP(A77,logistics!G:I,2,0)","v":1},{"$f":"VLOOKUP(A77,logistics!G:I,3,0)","v":"PRO/MAS"},"PRO-2017-0206",{"$f":"VLOOKUP(D77,AllDocs!A:D,2,0)","v":"mgmtObj_update_attributes_error"},{"$f":"VLOOKUP(D77,AllDocs!A:D,3,0)","v":"C-DOT"},{"$f":"VLOOKUP(D77,AllDocs!A:D,4,0)","v":"2017-09-06T04:38:04"},"Agreed",{"$f":"VLOOKUP(D77,AllDocs!A:F,6,0)","v":"CR"},"TS-0004 (WI-0009)",3]
["Thu-5 (17:00-18:30)",{"$f":"VLOOKUP(A78,logistics!G:I,2,0)","v":1},{"$f":"VLOOKUP(A78,logistics!G:I,3,0)","v":"PRO/MAS"},"PRO-2017-0264",{"$f":"VLOOKUP(D78,AllDocs!A:D,2,0)","v":"mgmtObj_update_attributes_error_MIRROR_R2"},{"$f":"VLOOKUP(D78,AllDocs!A:D,3,0)","v":"C-DOT"},{"$f":"VLOOKUP(D78,AllDocs!A:D,4,0)","v":"2017-09-14T08:41:42"},"Agreed",{"$f":"VLOOKUP(D78,AllDocs!A:F,6,0)","v":"CR"},"TS-0004 (WI-0009)",2]
["Thu-5 (17:00-18:30)",{"$f":"VLOOKUP(A79,logistics!G:I,2,0)","v":1},{"$f":"VLOOKUP(A79,logistics!G:I,3,0)","v":"PRO/MAS"},"PRO-2017-0265",{"$f":"VLOOKUP(D79,AllDocs!A:D,2,0)","v":"mgmtObj_correction"},{"$f":"VLOOKUP(D79,AllDocs!A:D,3,0)","v":"C-DOT"},{"$f":"VLOOKUP(D79,AllDocs!A:D,4,0)","v":"2017-09-14T08:44:01"},"Agreed",{"$f":"VLOOKUP(D79,AllDocs!A:F,6,0)","v":"CR"},"TS-0004 (WI-0009)",3]
["Thu-5 (17:00-18:30)",{"$f":"VLOOKUP(A80,logistics!G:I,2,0)","v":1},{"$f":"VLOOKUP(A80,logistics!G:I,3,0)","v":"PRO/MAS"},"PRO-2017-0266",{"$f":"VLOOKUP(D80,AllDocs!A:D,2,0)","v":"mgmtObj_correction_MIRROR_R2"},{"$f":"VLOOKUP(D80,AllDocs!A:D,3,0)","v":"C-DOT"},{"$f":"VLOOKUP(D80,AllDocs!A:D,4,0)","v":"2017-09-14T08:45:44"},"Agreed",{"$f":"VLOOKUP(D80,AllDocs!A:F,6,0)","v":"CR"},"TS-0004 (WI-0009)",2]
["Thu-5 (17:00-18:30)",{"$f":"VLOOKUP(A81,logistics!G:I,2,0)","v":1},{"$f":"VLOOKUP(A81,logistics!G:I,3,0)","v":"PRO/MAS"},"PRO-2017-0267",{"$f":"VLOOKUP(D81,AllDocs!A:D,2,0)","v":"mgmtObj_firmware_procedures_R3"},{"$f":"VLOOKUP(D81,AllDocs!A:D,3,0)","v":"C-DOT"},{"$f":"VLOOKUP(D81,AllDocs!A:D,4,0)","v":"2017-09-14T08:46:32"},"Agreed",{"$f":"VLOOKUP(D81,AllDocs!A:F,6,0)","v":"CR"},"TS-0004 (WI-0009)",3]
["Thu-5 (17:00-18:30)",{"$f":"VLOOKUP(A82,logistics!G:I,2,0)","v":1},{"$f":"VLOOKUP(A82,logistics!G:I,3,0)","v":"PRO/MAS"},"PRO-2017-0268",{"$f":"VLOOKUP(D82,AllDocs!A:D,2,0)","v":"mgmtObj_firmware_procedures_MIRROR_R2"},{"$f":"VLOOKUP(D82,AllDocs!A:D,3,0)","v":"C-DOT"},{"$f":"VLOOKUP(D82,AllDocs!A:D,4,0)","v":"2017-09-14T08:47:41"},"Agreed",{"$f":"VLOOKUP(D82,AllDocs!A:F,6,0)","v":"CR"},"TS-0004 (WI-0009)",2]
[null,{"$f":"VLOOKUP(A83,logistics!G:I,2,0)","v":{"$error":"#N/A"}},{"$f":"VLOOKUP(A83,logistics!G:I,3,0)","v":{"$error":"#N/A"}},null,{"$f":"VLOOKUP(D83,AllDocs!A:D,2,0)","v":{"$error":"#N/A"}},{"$f":"VLOOKUP(D83,AllDocs!A:D,3,0)","v":{"$error":"#N/A"}},{"$f":"VLOOKUP(D83,AllDocs!A:D,4,0)","v":{"$error":"#N/A"}},null,{"$f":"VLOOKUP(D83,AllDocs!A:F,6,0)","v":{"$error":"#N/A"}}]
["Fri-1 (08:30-10:00)",{"$f":"VLOOKUP(A84,logistics!G:I,2,0)","v":2},{"$f":"VLOOKUP(A84,logistics!G:I,3,0)","v":"MAS "},"<closing>",{"$f":"VLOOKUP(D84,AllDocs!A:D,2,0)","v":{"$error":"#N/A"}},{"$f":"VLOOKUP(D84,AllDocs!A:D,3,0)","v":{"$error":"#N/A"}},{"$f":"VLOOKUP(D84,AllDocs!A:D,4,0)","v":{"$error":"#N/A"}},null,{"$f":"VLOOKUP(D84,AllDocs!A:F,6,0)","v":{"$error":"#N/A"}}]
[null,{"$f":"VLOOKUP(A85,logistics!G:I,2,0)","v":{"$error":"#N/A"}},{"$f":"VLOOKUP(A85,logistics!G:I,3,0)","v":{"$error":"#N/A"}},"PRO-2017-0252",{"$f":"VLOOKUP(D85,AllDocs!A:D,2,0)","v":"Node Management"},{"$f":"VLOOKUP(D85,AllDocs!A:D,3,0)","v":"Huawei Technologies Co., Ltd."},{"$f":"VLOOKUP(D85,AllDocs!A:D,4,0)","v":"2017-09-11T01:28:47"},null,{"$f":"VLOOKUP(D85,AllDocs!A:F,6,0)","v":"CR"},"TS-0004 (WI-0009)",3]
[null,{"$f":"VLOOKUP(A86,logistics!G:I,2,0)","v":{"$error":"#N/A"}},{"$f":"VLOOKUP(A86,logistics!G:I,3,0)","v":{"$error":"#N/A"}},"PRO-2017-0201R01",{"$f":"VLOOKUP(D86,AllDocs!A:D,2,0)","v":{"$error":"#N/A"}},{"$f":"VLOOKUP(D86,AllDocs!A:D,3,0)","v":{"$error":"#N/A"}},{"$f":"VLOOKUP(D86,AllDocs!A:D,4,0)","v":{"$error":"#N/A"}},null,{"$f":"VLOOKUP(D86,AllDocs!A:F,6,0)","v":{"$error":"#N/A"}},"TS-0004 (WI-0009)",3,null,"R01 expected."]
[null,{"$f":"VLOOKUP(A87,logistics!G:I,2,0)","v":{"$error":"#N/A"}},{"$f":"VLOOKUP(A87,logistics!G:I,3,0)","v":{"$error":"#N/A"}},"PRO-2017-0263",{"$f":"VLOOKUP(D87,AllDocs!A:D,2,0)","v":"mgmtObj_update_MIRROR_R2"},{"$f":"VLOOKUP(D87,AllDocs!A:D,3,0)","v":"C-DOT"},{"$f":"VLOOKUP(D87,AllDocs!A:D,4,0)","v":"2017-09-14T08:39:23"},null,{"$f":"VLOOKUP(D87,AllDocs!A:F,6,0)","v":"CR"},"TS-0004 (WI-0009)",2]
[null,{"$f":"VLOOKUP(A88,logistics!G:I,2,0)","v":{"$error":"#N/A"}},{"$f":"VLOOKUP(A88,logistics!G:I,3,0)","v":{"$error":"#N/A"}},"PRO-2017-0288",{"$f":"VLOOKUP(D88,AllDocs!A:D,2,0)","v":"PRO-2017-0288-m2m_status_mgmtObj_R3"},{"$f":"VLOOKUP(D88,AllDocs!A:D,3,0)","v":"C-DOT"},{"$f":"VLOOKUP(D88,AllDocs!A:D,4,0)","v":"2017-09-21T11:53:37"},null,{"$f":"VLOOKUP(D88,AllDocs!A:F,6,0)","v":"CR"},"TS-0004 (WI-0009)",3]
[null,{"$f":"VLOOKUP(A89,logistics!G:I,2,0)","v":{"$error":"#N/A"}},{"$f":"VLOOKUP(A89,logistics!G:I,3,0)","v":{"$error":"#N/A"}},"PRO-2017-0289",{"$f":"VLOOKUP(D89,AllDocs!A:D,2,0)","v":"PRO-2017-0289-m2m_status_mgmtObj_MIRROR_R2"},{"$f":"VLOOKUP(D89,AllDocs!A:D,3,0)","v":"C-DOT"},{"$f":"VLOOKUP(D89,AllDocs!A:D,4,0)","v":"2017-09-21T11:57:31"},null,{"$f":"VLOOKUP(D89,AllDocs!A:F,6,0)","v":"CR"},"TS-0004 (WI-0009)",2]
[null,{"$f":"VLOOKUP(A90,logistics!G:I,2,0)","v":{"$error":"#N/A"}},{"$f":"VLOOKUP(A90,logistics!G:I,3,0)","v":{"$error":"#N/A"}},"PRO-2017-0234R01",{"$f":"VLOOKUP(D90,AllDocs!A:D,2,0)","v":{"$error":"#N/A"}},{"$f":"VLOOKUP(D90,AllDocs!A:D,3,0)","v":{"$error":"#N/A"}},{"$f":"VLOOKUP(D90,AllDocs!A:D,4,0)","v":{"$error":"#N/A"}},null,{"$f":"VLOOKUP(D90,AllDocs!A:F,6,0)","v":{"$error":"#N/A"}}]
[null,{"$f":"VLOOKUP(A91,logistics!G:I,2,0)","v":{"$error":"#N/A"}},{"$f":"VLOOKUP(A91,logistics!G:I,3,0)","v":{"$error":"#N/A"}},null,{"$f":"VLOOKUP(D91,AllDocs!A:D,2,0)","v":{"$error":"#N/A"}},{"$f":"VLOOKUP(D91,AllDocs!A:D,3,0)","v":{"$error":"#N/A"}},{"$f":"VLOOKUP(D91,AllDocs!A:D,4,0)","v":{"$error":"#N/A"}},null,{"$f":"VLOOKUP(D91,AllDocs!A:F,6,0)","v":{"$error":"#N/A"}}]
[null,{"$f":"VLOOKUP(A92,logistics!G:I,2,0)","v":{"$error":"#N/A"}},{"$f":"VLOOKUP(A92,logistics!G:I,3,0)","v":{"$error":"#N/A"}},null,{"$f":"VLOOKUP(D92,AllDocs!A:D,2,0)","v":{"$error":"#N/A"}},{"$f":"VLOOKUP(D92,AllDocs!A:D,3,0)","v":{"$error":"#N/A"}},{"$f":"VLOOKUP(D92,AllDocs!A:D,4,0)","v":{"$error":"#N/A"}},null,{"$f":"VLOOKUP(D92,AllDocs!A:F,6,0)","v":{"$error":"#N/A"}}]
[null,{"$f":"VLOOKUP(A93,logistics!G:I,2,0)","v":{"$error":"#N/A"}},{"$f":"VLOOKUP(A93,logistics!G:I,3,0)","v":{"$error":"#N/A"}},null,{"$f":"VLOOKUP(D93,AllDocs!A:D,2,0)","v":{"$error":"#N/A"}},{"$f":"VLOOKUP(D93,AllDocs!A:D,3,0)","v":{"$error":"#N/A"}},{"$f":"VLOOKUP(D93,AllDocs!A:D,4,0)","v":{"$error":"#N/A"}},null,{"$f":"VLOOKUP(D93,AllDocs!A:F,6,0)","v":{"$error":"#N/A"}}]
[null,{"$f":"VLOOKUP(A94,logistics!G:I,2,0)","v":{"$error":"#N/A"}},{"$f":"VLOOKUP(A94,logistics!G:I,3,0)","v":{"$error":"#N/A"}},null,{"$f":"VLOOKUP(D94,AllDocs!A:D,2,0)","v":{"$error":"#N/A"}},{"$f":"VLOOKUP(D94,AllDocs!A:D,3,0)","v":{"$error":"#N/A"}},{"$f":"VLOOKUP(D94,AllDocs!A:D,4,0)","v":{"$error":"#N/A"}},null,{"$f":"VLOOKUP(D94,AllDocs!A:F,6,0)","v":{"$error":"#N/A"}}]
[null,{"$f":"VLOOKUP(A95,logistics!G:I,2,0)","v":{"$error":"#N/A"}},{"$f":"VLOOKUP(A95,logistics!G:I,3,0)","v":{"$error":"#N/A"}},null,{"$f":"VLOOKUP(D95,AllDocs!A:D,2,0)","v":{"$error":"#N/A"}},{"$f":"VLOOKUP(D95,AllDocs!A:D,3,0)","v":{"$error":"#N/A"}},{"$f":"VLOOKUP(D95,AllDocs!A:D,4,0)","v":{"$error":"#N/A"}},null,{"$f":"VLOOKUP(D95,AllDocs!A:F,6,0)","v":{"$error":"#N/A"}}]
[null,{"$f":"VLOOKUP(A96,logistics!G:I,2,0)","v":{"$error":"#N/A"}},{"$f":"VLOOKUP(A96,logistics!G:I,3,0)","v":{"$error":"#N/A"}},null,{"$f":"VLOOKUP(D96,AllDocs!A:D,2,0)","v":{"$error":"#N/A"}},{"$f":"VLOOKUP(D96,AllDocs!A:D,3,0)","v":{"$error":"#N/A"}},{"$f":"VLOOKUP(D96,AllDocs!A:D,4,0)","v":{"$error":"#N/A"}},null,{"$f":"VLOOKUP(D96,AllDocs!A:F,6,0)","v":{"$error":"#N/A"}}]
[null,{"$f":"VLOOKUP(A97,logistics!G:I,2,0)","v":{"$error":"#N/A"}},{"$f":"VLOOKUP(A97,logistics!G:I,3,0)","v":{"$error":"#N/A"}},null,{"$f":"VLOOKUP(D97,AllDocs!A:D,2,0)","v":{"$error":"#N/A"}},{"$f":"VLOOKUP(D97,AllDocs!A:D,3,0)","v":{"$error":"#N/A"}},{"$f":"VLOOKUP(D97,AllDocs!A:D,4,0)","v":{"$error":"#N/A"}},null,{"$f":"VLOOKUP(D97,AllDocs!A:F,6,0)","v":{"$error":"#N/A"}}]
[null,{"$f":"VLOOKUP(A98,logistics!G:I,2,0)","v":{"$error":"#N/A"}},{"$f":"VLOOKUP(A98,logistics!G:I,3,0)","v":{"$error":"#N/A"}},null,{"$f":"VLOOKUP(D98,AllDocs!A:D,2,0)","v":{"$error":"#N/A"}},{"$f":"VLOOKUP(D98,AllDocs!A:D,3,0)","v":{"$error":"#N/A"}},{"$f":"VLOOKUP(D98,AllDocs!A:D,4,0)","v":{"$error":"#N/A"}},null,{"$f":"VLOOKUP(D98,AllDocs!A:F,6,0)","v":{"$error":"#N/A"}}]
[null,{"$f":"VLOOKUP(A99,logistics!G:I,2,0)","v":{"$error":"#N/A"}},{"$f":"VLOOKUP(A99,logistics!G:I,3,0)","v":{"$error":"#N/A"}},null,{"$f":"VLOOKUP(D99,AllDocs!A:D,2,0)","v":{"$error":"#N/A"}},{"$f":"VLOOKUP(D99,AllDocs!A:D,3,0)","v":{"$error":"#N/A"}},{"$f":"VLOOKUP(D99,AllDocs!A:D,4,0)","v":{"$error":"#N/A"}},null,{"$f":"VLOOKUP(D99,AllDocs!A:F,6,0)","v":{"$error":"#N/A"}}]
[null,{"$f":"VLOOKUP(A100,logistics!G:I,2,0)","v":{"$error":"#N/A"}},{"$f":"VLOOKUP(A100,logistics!G:I,3,0)","v":{"$error":"#N/A"}},null,{"$f":"VLOOKUP(D100,AllDocs!A:D,2,0)","v":{"$error":"#N/A"}},{"$f":"VLOOKUP(D100,AllDocs!A:D,3,0)","v":{"$error":"#N/A"}},{"$f":"VLOOKUP(D100,AllDocs!A:D,4,0)","v":{"$error":"#N/A"}},null,{"$f":"VLOOKUP(D100,AllDocs!A:F,6,0)","v":{"$error":"#N/A"}}]
[null,{"$f":"VLOOKUP(A101,logistics!G:I,2,0)","v":{"$error":"#N/A"}},{"$f":"VLOOKUP(A101,logistics!G:I,3,0)","v":{"$error":"#N/A"}},null,{"$f":"VLOOKUP(D101,AllDocs!A:D,2,0)","v":{"$error":"#N/A"}},{"$f":"VLOOKUP(D101,AllDocs!A:D,3,0)","v":{"$error":"#N/A"}},{"$f":"VLOOKUP(D101,AllDocs!A:D,4,0)","v":{"$error":"#N/A"}},null,{"$f":"VLOOKUP(D101,AllDocs!A:F,6,0)","v":{"$error":"#N/A"}}]
[null,{"$f":"VLOOKUP(A102,logistics!G:I,2,0)","v":{"$error":"#N/A"}},{"$f":"VLOOKUP(A102,logistics!G:I,3,0)","v":{"$error":"#N/A"}},null,{"$f":"VLOOKUP(D102,AllDocs!A:D,2,0)","v":{"$error":"#N/A"}},{"$f":"VLOOKUP(D102,AllDocs!A:D,3,0)","v":{"$error":"#N/A"}},{"$f":"VLOOKUP(D102,AllDocs!A:D,4,0)","v":{"$error":"#N/A"}},null,{"$f":"VLOOKUP(D102,AllDocs!A:F,6,0)","v":{"$error":"#N/A"}}]
[null,{"$f":"VLOOKUP(A103,logistics!G:I,2,0)","v":{"$error":"#N/A"}},{"$f":"VLOOKUP(A103,logistics!G:I,3,0)","v":{"$error":"#N/A"}},null,{"$f":"VLOOKUP(D103,AllDocs!A:D,2,0)","v":{"$error":"#N/A"}},{"$f":"VLOOKUP(D103,AllDocs!A:D,3,0)","v":{"$error":"#N/A"}},{"$f":"VLOOKUP(D103,AllDocs!A:D,4,0)","v":{"$error":"#N/A"}},null,{"$f":"VLOOKUP(D103,AllDocs!A:F,6,0)","v":{"$error":"#N/A"}}]
[null,{"$f":"VLOOKUP(A104,logistics!G:I,2,0)","v":{"$error":"#N/A"}},{"$f":"VLOOKUP(A104,logistics!G:I,3,0)","v":{"$error":"#N/A"}},null,{"$f":"VLOOKUP(D104,AllDocs!A:D,2,0)","v":{"$error":"#N/A"}},{"$f":"VLOOKUP(D104,AllDocs!A:D,3,0)","v":{"$error":"#N/A"}},{"$f":"VLOOKUP(D104,AllDocs!A:D,4,0)","v":{"$error":"#N/A"}},null,{"$f":"VLOOKUP(D104,AllDocs!A:F,6,0)","v":{"$error":"#N/A"}}]
[null,{"$f":"VLOOKUP(A105,logistics!G:I,2,0)","v":{"$error":"#N/A"}},{"$f":"VLOOKUP(A105,logistics!G:I,3,0)","v":{"$error":"#N/A"}},null,{"$f":"VLOOKUP(D105,AllDocs!A:D,2,0)","v":{"$error":"#N/A"}},{"$f":"VLOOKUP(D105,AllDocs!A:D,3,0)","v":{"$error":"#N/A"}},{"$f":"VLOOKUP(D105,AllDocs!A:D,4,0)","v":{"$error":"#N/A"}},null,{"$f":"VLOOKUP(D105,AllDocs!A:F,6,0)","v":{"$error":"#N/A"}}]
[null,{"$f":"VLOOKUP(A106,logistics!G:I,2,0)","v":{"$error":"#N/A"}},{"$f":"VLOOKUP(A106,logistics!G:I,3,0)","v":{"$error":"#N/A"}},null,{"$f":"VLOOKUP(D106,AllDocs!A:D,2,0)","v":{"$error":"#N/A"}},{"$f":"VLOOKUP(D106,AllDocs!A:D,3,0)","v":{"$error":"#N/A"}},{"$f":"VLOOKUP(D106,AllDocs!A:D,4,0)","v":{"$error":"#N/A"}},null,{"$f":"VLOOKUP(D106,AllDocs!A:F,6,0)","v":{"$error":"#N/A"}}]
[null,{"$f":"VLOOKUP(A107,logistics!G:I,2,0)","v":{"$error":"#N/A"}},{"$f":"VLOOKUP(A107,logistics!G:I,3,0)","v":{"$error":"#N/A"}},null,{"$f":"VLOOKUP(D107,AllDocs!A:D,2,0)","v":{"$error":"#N/A"}},{"$f":"VLOOKUP(D107,AllDocs!A:D,3,0)","v":{"$error":"#N/A"}},{"$f":"VLOOKUP(D107,AllDocs!A:D,4,0)","v":{"$error":"#N/A"}},null,{"$f":"VLOOKUP(D107,AllDocs!A:F,6,0)","v":{"$error":"#N/A"}}]
[null,{"$f":"VLOOKUP(A108,logistics!G:I,2,0)","v":{"$error":"#N/A"}},{"$f":"VLOOKUP(A108,logistics!G:I,3,0)","v":{"$error":"#N/A"}},null,{"$f":"VLOOKUP(D108,AllDocs!A:D,2,0)","v":{"$error":"#N/A"}},{"$f":"VLOOKUP(D108,AllDocs!A:D,3,0)","v":{"$error":"#N/A"}},{"$f":"VLOOKUP(D108,AllDocs!A:D,4,0)","v":{"$error":"#N/A"}},null,{"$f":"VLOOKUP(D108,AllDocs!A:F,6,0)","v":{"$error":"#N/A"}}]
[null,{"$f":"VLOOKUP(A109,logistics!G:I,2,0)","v":{"$error":"#N/A"}},{"$f":"VLOOKUP(A109,logistics!G:I,3,0)","v":{"$error":"#N/A"}},null,{"$f":"VLOOKUP(D109,AllDocs!A:D,2,0)","v":{"$error":"#N/A"}},{"$f":"VLOOKUP(D109,AllDocs!A:D,3,0)","v":{"$error":"#N/A"}},{"$f":"VLOOKUP(D109,AllDocs!A:D,4,0)","v":{"$error":"#N/A"}},null,{"$f":"VLOOKUP(D109,AllDocs!A:F,6,0)","v":{"$error":"#N/A"}}]
[null,{"$f":"VLOOKUP(A110,logistics!G:I,2,0)","v":{"$error":"#N/A"}},{"$f":"VLOOKUP(A110,logistics!G:I,3,0)","v":{"$error":"#N/A"}},null,{"$f":"VLOOKUP(D110,AllDocs!A:D,2,0)","v":{"$error":"#N/A"}},{"$f":"VLOOKUP(D110,AllDocs!A:D,3,0)","v":{"$error":"#N/A"}},{"$f":"VLOOKUP(D110,AllDocs!A:D,4,0)","v":{"$error":"#N/A"}},null,{"$f":"VLOOKUP(D110,AllDocs!A:F,6,0)","v":{"$error":"#N/A"}}]
[null,{"$f":"VLOOKUP(A111,logistics!G:I,2,0)","v":{"$error":"#N/A"}},{"$f":"VLOOKUP(A111,logistics!G:I,3,0)","v":{"$error":"#N/A"}},null,{"$f":"VLOOKUP(D111,AllDocs!A:D,2,0)","v":{"$error":"#N/A"}},{"$f":"VLOOKUP(D111,AllDocs!A:D,3,0)","v":{"$error":"#N/A"}},{"$f":"VLOOKUP(D111,AllDocs!A:D,4,0)","v":{"$error":"#N/A"}},null,{"$f":"VLOOKUP(D111,AllDocs!A:F,6,0)","v":{"$error":"#N/A"}}]
[null,{"$f":"VLOOKUP(A112,logistics!G:I,2,0)","v":{"$error":"#N/A"}},{"$f":"VLOOKUP(A112,logistics!G:I,3,0)","v":{"$error":"#N/A"}},null,{"$f":"VLOOKUP(D112,AllDocs!A:D,2,0)","v":{"$error":"#N/A"}},{"$f":"VLOOKUP(D112,AllDocs!A:D,3,0)","v":{"$error":"#N/A"}},{"$f":"VLOOKUP(D112,AllDocs!A:D,4,0)","v":{"$error":"#N/A"}},null,{"$f":"VLOOKUP(D112,AllDocs!A:F,6,0)","v":{"$error":"#N/A"}}]
[null,{"$f":"VLOOKUP(A113,logistics!G:I,2,0)","v":{"$error":"#N/A"}},{"$f":"VLOOKUP(A113,logistics!G:I,3,0)","v":{"$error":"#N/A"}},null,{"$f":"VLOOKUP(D113,AllDocs!A:D,2,0)","v":{"$error":"#N/A"}},{"$f":"VLOOKUP(D113,AllDocs!A:D,3,0)","v":{"$error":"#N/A"}},{"$f":"VLOOKUP(D113,AllDocs!A:D,4,0)","v":{"$error":"#N/A"}},null,{"$f":"VLOOKUP(D113,AllDocs!A:F,6,0)","v":{"$error":"#N/A"}}]
[null,{"$f":"VLOOKUP(A114,logistics!G:I,2,0)","v":{"$error":"#N/A"}},{"$f":"VLOOKUP(A114,logistics!G:I,3,0)","v":{"$error":"#N/A"}},null,{"$f":"VLOOKUP(D114,AllDocs!A:D,2,0)","v":{"$error":"#N/A"}},{"$f":"VLOOKUP(D114,AllDocs!A:D,3,0)","v":{"$error":"#N/A"}},{"$f":"VLOOKUP(D114,AllDocs!A:D,4,0)","v":{"$error":"#N/A"}},null,{"$f":"VLOOKUP(D114,AllDocs!A:F,6,0)","v":{"$error":"#N/A"}}]
[null,{"$f":"VLOOKUP(A115,logistics!G:I,2,0)","v":{"$error":"#N/A"}},{"$f":"VLOOKUP(A115,logistics!G:I,3,0)","v":{"$error":"#N/A"}},null,{"$f":"VLOOKUP(D115,AllDocs!A:D,2,0)","v":{"$error":"#N/A"}},{"$f":"VLOOKUP(D115,AllDocs!A:D,3,0)","v":{"$error":"#N/A"}},{"$f":"VLOOKUP(D115,AllDocs!A:D,4,0)","v":{"$error":"#N/A"}},null,{"$f":"VLOOKUP(D115,AllDocs!A:F,6,0)","v":{"$error":"#N/A"}}]
[null,{"$f":"VLOOKUP(A116,logistics!G:I,2,0)","v":{"$error":"#N/A"}},{"$f":"VLOOKUP(A116,logistics!G:I,3,0)","v":{"$error":"#N/A"}},null,{"$f":"VLOOKUP(D116,AllDocs!A:D,2,0)","v":{"$error":"#N/A"}},{"$f":"VLOOKUP(D116,AllDocs!A:D,3,0)","v":{"$error":"#N/A"}},{"$f":"VLOOKUP(D116,AllDocs!A:D,4,0)","v":{"$error":"#N/A"}},null,{"$f":"VLOOKUP(D116,AllDocs!A:F,6,0)","v":{"$error":"#N/A"}}]
[null,{"$f":"VLOOKUP(A117,logistics!G:I,2,0)","v":{"$error":"#N/A"}},{"$f":"VLOOKUP(A117,logistics!G:I,3,0)","v":{"$error":"#N/A"}},null,{"$f":"VLOOKUP(D117,AllDocs!A:D,2,0)","v":{"$error":"#N/A"}},{"$f":"VLOOKUP(D117,AllDocs!A:D,3,0)","v":{"$error":"#N/A"}},{"$f":"VLOOKUP(D117,AllDocs!A:D,4,0)","v":{"$error":"#N/A"}},null,{"$f":"VLOOKUP(D117,AllDocs!A:F,6,0)","v":{"$error":"#N/A"}}]
[null,{"$f":"VLOOKUP(A118,logistics!G:I,2,0)","v":{"$error":"#N/A"}},{"$f":"VLOOKUP(A118,logistics!G:I,3,0)","v":{"$error":"#N/A"}},null,{"$f":"VLOOKUP(D118,AllDocs!A:D,2,0)","v":{"$error":"#N/A"}},{"$f":"VLOOKUP(D118,AllDocs!A:D,3,0)","v":{"$error":"#N/A"}},{"$f":"VLOOKUP(D118,AllDocs!A:D,4,0)","v":{"$error":"#N/A"}},null,{"$f":"VLOOKUP(D118,AllDocs!A:F,6,0)","v":{"$error":"#N/A"}}]

{"sheet":"logistics","index":1,"n_rows":32,"n_cols":12,"rows_kept":32,"cut":false,"hidden":false,"merged":[]}
["WeekDay","SlotTime","Day","Slot","Time","AllSlots","MAS Slots","Rooms","WGs","WIs","Short Name","Deadline"]
["Mon","9:00-10:30","Mon",1,"9:00-10:30",{"$f":"CONCATENATE(C2,\"-\",D2,\" (\",E2,\")\")","v":"Mon-1 (9:00-10:30)"},{"$f":"IF(COUNTA(I2),CELL(\"contents\",F2),\"\")","v":""},null,null,"TR-0001 (WI-0015)","Use Case Continuation","2017-09-11T14:30:00"]
["Tue","10:30-11:00","Mon",2,"11:00-12:30","Mon-2 (11:00-12:30)",{"$f":"IF(COUNTA(I3),CELL(\"contents\",F3),\"\")","v":""},null,null,"TR-0007 (WI-0053)","Semantic Study"]
["Wed","11:00-12:30","Mon",3,"13:30-15:00",{"$f":"CONCATENATE(C4,\"-\",D4,\" (\",E4,\")\")","v":"Mon-3 (13:30-15:00)"},"Mon-3 (13:30-15:00)",1,"MAS ","TR-0014 (WI-0018)","oneM2M AllJoyn Interworking"]
["Thu","12:30-13:30","Mon",4,"15:30-17:00",{"$f":"CONCATENATE(C5,\"-\",D5,\" (\",E5,\")\")","v":"Mon-4 (15:30-17:00)"},"",null,null,"TR-0017 (WI-0017)","Home Domain Abstract Information Model"]
["Fri","13:30-15:00","Mon",5,"17:00-18:30","Mon-5 (17:00-18:30)","Mon-5 (17:00-18:30)",3,"MAS-adhoc","TR-0018 (WI-0059)","Industry Domain Enablement"]
[null,"15:00-15:30","Tue",1,"08:30-10:00","Tue-1 (08:30-10:00)",{"$f":"IF(COUNTA(#REF!),CELL(\"contents\",F7),\"\")","v":"Tue-1 (08:30-10:00)"},1,"ARC/MAS","TR-0022 (WI-0043)","Continuation & integration of HGI Smart Home activities"]
[null,"15:30-17:00","Tue",2,"10:30-12:00","Tue-2 (10:30-12:00)","Tue-2 (10:30-12:00)",2,"MAS ","TR-0031 (WI-0052)","LWM2M DM Interworking Enhancement"]
[null,"17:00-18:30","Tue",3,"13:30-15:00",{"$f":"CONCATENATE(C9,\"-\",D9,\" (\",E9,\")\")","v":"Tue-3 (13:30-15:00)"},"Tue-3 (13:30-15:00)",2,"PRO/MAS","TR-0039 (WI-0054)","Developer guide-SDT-based implementation"]
[null,null,"Tue",4,"15:30-17:00","Tue-4 (15:30-17:00)","Tue-4 (15:30-17:00)",3,"MAS-adhoc","TR-0033 (WI-0053)","Study on Enhanced Semantic Enablement"]
[null,"08:30-10:00","Tue",5,"17:00-18:30","Tue-5 (17:00-18:30)","Tue-5 (17:00-18:30)",2,"PRO/MAS","TR-0042 (WI-0071)","WoT Interworking"]
[null,"10:00-10:30","Wed",1,"08:30-10:00","Wed-1 (08:30-10:00)","",null,null,"TR-0043 (WI-0072)","Modbus Interworking"]
[null,"10:30-12:00","Wed",2,"10:30-12:00","Wed-2 (10:30-12:00)","",null,null,"TR-0045 (WI-0054)","Developer Guide: Implementing Semantics"]
[null,"12:00-13:30","Wed",3,"13:30-15:00","Wed-3 (13:30-15:00)","",null,null,"TS-0001 (WI-0002)","Architecture"]
[null,"13:30-15:00","Wed",4,"15:30-17:00","Wed-4 (15:30-17:00)","",null,null,"TS-0002 (WI-0001)","Requirement"]
[null,"15:00-15:30","Wed",5,"17:00-18:30","Wed-5 (17:00-18:30)","",null,null,"TS-0004 (WI-0009)","Protocol Core"]
[null,"15:30-17:00","Thu",1,"08:30-10:00","Thu-1 (08:30-10:00)","",null,null,"TS-0005 (WI-0010)","OMA Mapping"]
[null,"17:00-18:30","Thu",2,"10:30-12:00","Thu-2 (10:30-12:00)","Thu-2 (10:30-12:00)",2,"MAS ","TS-0006 (WI-0010)","BBF Mapping"]
[null,null,"Thu",3,"13:30-15:00","Thu-3 (13:30-15:00)","Thu-3 (13:30-15:00)",2,"TST/MAS","TS-0007 (WI-0011)","SOA Architecture"]
[null,null,"Thu",4,"15:30-17:00","Thu-4 (15:30-17:00)","Thu-4 (15:30-17:00)",3,"MAS-adhoc","TS-0009 (WI-0013)","HTTP Binding"]
[null,null,"Thu",5,"17:00-18:30","Thu-5 (17:00-18:30)","Thu-5 (17:00-18:30)",1,"PRO/MAS","TS-0012 (WI-0063)","oneM2M Base Ontology"]
[null,null,"Thu",6,"18:30-20:00",{"$f":"CONCATENATE(C22,\"-\",D22,\" (\",E22,\")\")","v":"Thu-6 (18:30-20:00)"},"",null,null,"TS-0013 (WI-0060)","Interoperability Testing"]
[null,null,"Fri",1,"08:30-10:00","Fri-1 (08:30-10:00)","Fri-1 (08:30-10:00)",2,"MAS ","TS-0014 (WI-0024)","LWM2M_Interworking"]
[null,null,"Fri",2,"10:30-12:00","Fri-2 (10:30-12:00)","",null,null,"TS-0022 (WI-0030)","Field Device Configuration "]
[null,null,"Fri",3,"13:30-15:00","Fri-3 (13:30-15:00)","",null,null,"TS-0023 (WI-0056)","Home Appliances Information Model and Mapping"]
[null,null,"Fri",4,"15:30-17:00","Fri-4 (15:30-17:00)","",null,null,"TS-0030 (WI-0063)","Generic Interworking"]
[null,null,null,null,null,"- ()","",null,null,"TS-0033 (WI-0056)","Proximal Interworking"]
[null,null,null,null,null,null,"",null,null,"TS-0034 (WI-0053)","Semantic Support"]
[null,null,null,null,null,null,"",null,null,"Generic"]
[null,null,null,null,null,null,{"$f":"IF(COUNTA(I30),CELL(\"contents\",F30),\"\")","v":""}]
[null,null,null,null,null,null,""]
[null,null,null,null,null,null,""]

{"sheet":"AllDocs","index":2,"n_rows":476,"n_cols":8,"rows_kept":476,"cut":false,"hidden":false,"merged":[]}
["SHORT DOC NB","SHORTNAME","SOURCE","UPLOADED","STATUS","DOC TYPE","VERS","MEETING"]
["ARC-2017-0161","deviceCapability-attributes_RW-R3","C-DOT","2017-04-11T04:18:41","Draft","CR",null,"ARC 31"]
["ARC-2017-0162","deviceCapability-attributes_RW- MIRROR R2","C-DOT","2017-04-11T04:22:18","Draft","CR",null,"ARC 31"]
["PRO-2017-0155","Generic procedure for handling a Request at a receiver R3","KT","2017-07-02T04:26:54","Draft","CR",null,"PRO 31"]
["PRO-2017-0169","Fixed header of MQTT PUBLISH Packet","KT","2017-07-12T14:25:10","Draft","CR",null,"PRO 31"]
["ARC-2017-0296R02","TS-0026_Change_of_Chargeable_Party_Procedures","Convida","2017-07-14T13:13:31","Draft","CR",null,"ARC 31"]
["REQ-2017-0054","CR_TS-0011_Security_Principal","Qualcomm Inc. (TIA)","2017-07-14T16:34:36","Draft","CR",null,"REQ 31"]
["TP-2017-0232","User Services Platform specification available for review","Broadband Forum","2017-07-28T07:37:06","Noted","LS",null,"TP 31"]
["TP-2017-0234","ITU-T Y.oneM2M.DM.BBF","Timothy Carey, Nokia","2017-07-28T15:52:52","Draft","INC",null,"TP 31"]
["TP-2017-0233","ITU-T Y.oneM2M.IWK.LwM2M","Timothy Carey, Nokia","2017-07-28T15:53:16","Draft","INC",null,"TP 31"]
["TP-2017-0234R01","ITU-T Y.oneM2M.DM.BBF","Timothy Carey, Nokia","2017-07-31T13:06:49","Draft","INC",null,"TP 31"]
["TP-2017-0233R01","ITU-T Y.oneM2M.IWK.LwM2M","Timothy Carey, Nokia","2017-07-31T13:07:16","Draft","INC",null,"TP 31"]
["TP-2017-0128R03","Draft_Release_2A_Control_Document","Roland Hechwartner, WPM Convenor","2017-07-31T13:19:42","Draft","INC",null,"TP 31"]
["TP-2017-0235","ITU-T_Y_oneM2M_CT","Roland Hechwartner, Deutsche Telekom","2017-07-31T13:36:35","Draft","INC",null,"TP 31"]
["TP-2017-0233R02","ITU-T Y.oneM2M.IWK.LwM2M","Timothy Carey, Nokia","2017-07-31T13:45:55","Draft","INC",null,"TP 31"]
["TP-2017-0234R02","ITU-T Y.oneM2M.DM.BBF","Timothy Carey, Nokia","2017-07-31T13:46:21","Draft","INC",null,"TP 31"]
["TP-2017-0236","ITU Y.oneM2M.UCC","Convida, KDDI","2017-07-31T14:16:27","Draft","CR",null,"TP 31"]
["PRO-2017-0185","CoAP Content-Format ID","QUALCOMM Inc. (TIA)","2017-08-01T04:47:57","Draft","CR",null,"PRO 31"]
["PRO-2017-0090R02","NewEventNotificationCriteria(R3)","C-DOT","2017-08-01T04:54:19","Agreed","CR",null,"PRO 31"]
["TP-2017-0234R03","ITU-T Y.oneM2M.DM.BBF","Timothy Carey, Nokia","2017-08-02T10:22:47","Draft","INC",null,"TP 31"]
["TP-2017-0233R03","ITU-T Y.oneM2M.IWK.LwM2M","Timothy Carey, Nokia","2017-08-02T10:23:33","Draft","INC",null,"TP 31"]
["TP-2017-0236R01","ITU-T Y.oneM2M.UCC","Convida, KDDI, Nokia","2017-08-02T12:27:21","Draft","CR",null,"TP 31"]
["ARC-2017-0341","ScheduleResourceEditorialCleanup","Convida","2017-08-03T11:04:13","Noted","CR",null,"ARC 31"]
["TP-2017-0236R02","ITU-T Y.oneM2M.UCC","Convida, KDDI, Nokia","2017-08-04T15:28:16","Draft","CR",null,"TP 31"]
["PRO-2017-0191","deviceInfo_attributes_R3","C-DOT","2017-08-08T12:06:41","Draft","CR",null,"PRO 31"]
["TP-2017-0233R04","ITU-T Y.oneM2M.IWK.LwM2M","Timothy Carey, Nokia","2017-08-08T18:05:11","Draft","INC",null,"TP 31"]
["TP-2017-0234R04","ITU-T Y.oneM2M.DM.BBF","Timothy Carey, Nokia","2017-08-08T18:05:36","Draft","INC",null,"TP 31"]
["ARC-2017-0344R01","Clarification_on_M2M-Service-Profile-Identifier","C-DOT","2017-08-09T08:36:53","Draft","CR",null,"ARC 31"]
["TP-2017-0237","ITU-T Y.oneM2M.SLCP","Nobu Uchida, QUALCOMM","2017-08-10T04:51:49","Draft","INC",null,"TP 31"]
["TP-2017-0241","ITU-T Y.oneM2M.PB.WebSocket","Nobu Uchida, QUALCOMM","2017-08-10T06:32:48","Draft","INC",null,"TP 31"]
["TP-2017-0237R01","ITU-T Y.oneM2M.SLCP","Nobu Uchida, QUALCOMM","2017-08-10T06:40:05","Draft","INC",null,"TP 31"]
["TP-2017-0235R01","ITU-T_Y_oneM2M_CT","Roland Hechwartner, Deutsche Telekom","2017-08-10T09:14:15","Draft","INC",null,"TP 31"]
["TP-2017-0242","ITU-T_Y_oneM2M_FDC","Qualcomm Inc. (TIA)","2017-08-10T18:23:29","Draft","INC",null,"TP 31"]
["REQ-2017-0055","Draft-TR-0026-Vehicular_Domain_Enablement_v_0_10_1","KDDI, Convida, Huawei Technologies","2017-08-11T06:26:10","Agreed","CR",null,"REQ 31"]
["TP-2017-0245","Voting List for TP31","Karen Hughes, Secretariat","2017-08-11T08:45:51","Agreed","INC",null,"TP 31"]
["TP-2017-0246","ITU-T_Y_oneM2M_Ind_DE","Hitachi","2017-08-11T09:09:18","Draft","INC",null,"TP 31"]
["TP-2017-0247","ITU-T Y.oneM2M.PB.MQTT","MQTT Rapporteur","2017-08-11T16:04:26","Draft","INC",null,"TP 31"]
["TP-2017-0248","ITU-T_Y_oneM2M_DG_SEM","Martin Bauer, NEC","2017-08-12T20:53:38","Draft","INC",null,"TP 31"]
["TP-2017-0244","ITU-T_Y_oneM2M_MAF_MEF","Qualcomm Inc. (TIA)","2017-08-14T00:52:42","Draft","INC",null,"TP 31"]
["TP-2017-0243","ITU-T_Y_oneM2M_SEC_SOL","Qualcomm Inc. (TIA)","2017-08-14T00:53:37","Draft","INC",null,"TP 31"]
["TP-2017-0242R01","ITU-T_Y_oneM2M_FDC","Qualcomm Inc. (TIA)","2017-08-14T00:54:43","Draft","INC",null,"TP 31"]
["TP-2017-0246R01","ITU-T_Y_oneM2M_Ind_DE","Hitachi","2017-08-14T05:53:02","Draft","INC",null,"TP 31"]
["TP-2017-0249","ITU-T_Y_oneM2M_DG_CoAP","Shane HE, Nokia","2017-08-14T08:50:27","Draft","INC",null,"TP 31"]
["TP-2017-0250","ITU-T_Y_oneM2M_ARC","ZTE","2017-08-14T09:13:04","Draft","INC",null,"TP 31"]
["TP-2017-0243R01","ITU-T_Y_oneM2M_SEC_SOL","Qualcomm Inc. (TIA)","2017-08-14T11:50:53","Draft","INC",null,"TP 31"]
["TP-2017-0234R05","ITU-T Y.oneM2M.DM.BBF","Timothy Carey, Nokia","2017-08-14T13:44:18","Draft","INC",null,"TP 31"]
["TP-2017-0233R05","ITU-T Y.oneM2M.IWK.LwM2M","Timothy Carey, Nokia","2017-08-14T13:44:47","Draft","INC",null,"TP 31"]
["TP-2017-0242R02","ITU-T_Y_oneM2M_FDC","Qualcomm Inc. (TIA)","2017-08-14T15:02:38","Draft","INC",null,"TP 31"]
["TP-2017-0241R01","ITU-T Y.oneM2M.PB.WebSocket","Nobu Uchida, QUALCOMM","2017-08-14T15:16:40","Draft","INC",null,"TP 31"]
["TP-2017-0247R01","ITU-T Y.oneM2M.PB.MQTT","MQTT Rapporteur","2017-08-14T15:45:30","Draft","INC",null,"TP 31"]
["TP-2017-0241R02","ITU-T Y.oneM2M.PB.WebSocket","Nobu Uchida, QUALCOMM","2017-08-14T15:54:27","Draft","INC",null,"TP 31"]
["TP-2017-0243R02","ITU-T_Y_oneM2M_SEC_SOL","Qualcomm Inc. (TIA)","2017-08-14T16:21:24","Draft","INC",null,"TP 31"]
["TP-2017-0244R01","ITU-T_Y_oneM2M_MAF_MEF","Qualcomm Inc. (TIA)","2017-08-14T16:22:08","Draft","INC",null,"TP 31"]
["TP-2017-0236R03","ITU-T Y.oneM2M.UCC","Convida, KDDI, Nokia","2017-08-14T17:57:33","Draft","CR",null,"TP 31"]
["TP-2017-0237R02","ITU-T Y.oneM2M.SLCP","Nobu Uchida, QUALCOMM","2017-08-14T18:21:03","Draft","INC",null,"TP 31"]
["TP-2017-0182R06","ITU-T Y.oneM2M.REQ","Huawei Technologies Co., Ltd.","2017-08-15T06:27:53","Draft","INC",null,"TP 31"]
["TP-2017-0236R04","ITU-T Y.oneM2M.UCC","Convida, KDDI, Nokia","2017-08-15T14:44:05","Draft","CR",null,"TP 31"]
["TP-2017-0237R03","ITU-T Y.oneM2M.SLCP","Nobu Uchida, QUALCOMM","2017-08-15T21:36:17","Draft","INC",null,"TP 31"]
["TP-2017-0241R03","ITU-T Y.oneM2M.PB.WebSocket","Nobu Uchida, QUALCOMM","2017-08-15T21:41:07","Draft","INC",null,"TP 31"]
["TP-2017-0251","ITU-T Y.oneM2M.DG.DM","Huawei Technologies Co., Ltd.","2017-08-16T10:59:40","Draft","INC",null,"TP 31"]
["TP-2017-0252","ITU-T Y.oneM2M.DM.OMA","Huawei Technologies Co., Ltd.","2017-08-16T11:02:27","Draft","INC",null,"TP 31"]
["TP-2017-0253","ITU-T Y.oneM2M.PB.COAP","Huawei Technologies Co., Ltd.","2017-08-16T11:04:53","Draft","INC",null,"TP 31"]
["TP-2017-0254","ITU-T Y.oneM2M.TF","Huawei Technologies Co., Ltd.","2017-08-16T11:07:10","Draft","INC",null,"TP 31"]
["ARC-2017-0349","TS-0001-mgmtObj_firmware_software_R3","C-DOT","2017-08-16T12:33:59","Noted","CR",null,"ARC 31"]
["ARC-2017-0350","TS-0001-mgmtObj_firmware_software_MIRROR_R2","C-DOT","2017-08-16T12:35:33","Noted","CR",null,"ARC 31"]
["TP-2017-0246R02","ITU-T_Y_oneM2M_Ind_DE","Hitachi","2017-08-17T01:16:04","Draft","INC",null,"TP 31"]
["TP-2017-0250R01","ITU-T_Y_oneM2M_ARC","ZTE","2017-08-17T03:43:04","Draft","INC",null,"TP 31"]
["TP-2017-0255","ITU-T Y.oneM2M.PB.HTTP","KETI","2017-08-17T05:06:10","Draft","INC",null,"TP 31"]
["TP-2017-0254R01","ITU-T Y.oneM2M.TF","Huawei Technologies Co., Ltd.","2017-08-17T06:41:57","Draft","INC",null,"TP 31"]
["TP-2017-0253R01","ITU-T Y.oneM2M.PB.COAP","Huawei Technologies Co., Ltd.","2017-08-17T06:42:28","Draft","INC",null,"TP 31"]
["TP-2017-0252R01","ITU-T Y.oneM2M.DM.OMA","Huawei Technologies Co., Ltd.","2017-08-17T06:42:52","Draft","INC",null,"TP 31"]
["TP-2017-0251R01","ITU-T Y.oneM2M.DG.DM","Huawei Technologies Co., Ltd.","2017-08-17T06:43:15","Draft","INC",null,"TP 31"]
["TP-2017-0255R01","ITU-T Y.oneM2M.PB.HTTP","KETI","2017-08-17T08:56:16","Draft","INC",null,"TP 31"]
["TP-2017-0256","ITU-T_Y_oneM2M_BO","NEC","2017-08-17T12:54:08","Draft","INC",null,"TP 31"]
["TP-2017-0255R02","ITU-T Y.oneM2M.PB.HTTP","KETI","2017-08-18T05:56:40","Draft","INC",null,"TP 31"]
["TP-2017-0251R02","ITU-T Y.oneM2M.DG.DM","Huawei Technologies Co., Ltd.","2017-08-18T06:03:29","Draft","INC",null,"TP 31"]
["TP-2017-0252R02","ITU-T Y.oneM2M.DM.OMA","Huawei Technologies Co., Ltd.","2017-08-18T06:03:50","Draft","INC",null,"TP 31"]
["TP-2017-0253R02","ITU-T Y.oneM2M.PB.COAP","Huawei Technologies Co., Ltd.","2017-08-18T06:04:08","Draft","INC",null,"TP 31"]
["TP-2017-0254R02","ITU-T Y.oneM2M.TF","Huawei Technologies Co., Ltd.","2017-08-18T06:04:29","Draft","INC",null,"TP 31"]
["TP-2017-0246R03","ITU-T_Y_oneM2M_Ind_DE","Hitachi","2017-08-18T09:36:49","Draft","INC",null,"TP 31"]
["TP-2017-0182R07","ITU-T Y.oneM2M.REQ","Huawei Technologies Co., Ltd.","2017-08-18T10:31:22","Draft","INC",null,"TP 31"]
["TP-2017-0235R02","ITU-T_Y_oneM2M_CT","Roland Hechwartner, Deutsche Telekom","2017-08-18T12:45:50","Draft","INC",null,"TP 31"]
["TP-2017-0182R08","ITU-T Y.oneM2M.REQ","Huawei Technologies Co., Ltd.","2017-08-18T13:19:44","Draft","INC",null,"TP 31"]
["TP-2017-0257","ITU-T_Y.oneM2M.DG.AppDev","Laurent Velez, ETSI","2017-08-18T15:23:53","Draft","INC",null,"TP 31"]
["TP-2017-0258","Y.oneM2M.InteropTest","Laurent Velez, ETSI","2017-08-18T16:40:38","Draft","INC",null,"TP 31"]
["TP-2017-0258R01","ITU-T_Y_oneM2M_InteropTest","Laurent Velez, ETSI","2017-08-18T16:44:34","Draft","INC",null,"TP 31"]
["TP-2017-0257R01","ITU-T_Y.oneM2M.DG.AppDev","Laurent Velez, ETSI","2017-08-18T16:47:37","Draft","INC",null,"TP 31"]
["TP-2017-0233R06","ITU-T Y.oneM2M.IWK.LwM2M","Timothy Carey, Nokia","2017-08-20T11:58:34","Draft","INC",null,"TP 31"]
["TP-2017-0234R06","ITU-T Y.oneM2M.DM.BBF","Timothy Carey, Nokia","2017-08-20T12:01:29","Draft","INC",null,"TP 31"]
["TP-2017-0257R02","ITU-T_Y.oneM2M.DG.AppDev","Laurent Velez, ETSI","2017-08-20T13:24:09","Draft","INC",null,"TP 31"]
["TP-2017-0258R02","ITU-T_Y_oneM2M_InteropTest","Laurent Velez, ETSI","2017-08-20T13:24:58","Draft","INC",null,"TP 31"]
["TP-2017-0246R04","ITU-T_Y_oneM2M_Ind_DE","Hitachi","2017-08-21T01:56:05","Draft","INC",null,"TP 31"]
["TP-2017-0247R02","ITU-T Y.oneM2M.PB.MQTT","MQTT Rapporteur","2017-08-21T02:31:00","Draft","INC",null,"TP 31"]
["TP-2017-0246R05","ITU-T_Y_oneM2M_Ind_DE","Hitachi","2017-08-21T05:32:06","Draft","INC",null,"TP 31"]
["TP-2017-0259","ITU-T Y.oneM2M.HAIM","Huawei Technologies Co., Ltd.","2017-08-21T07:55:46","Draft","AG",null,"TP 31"]
["TP-2017-0248R01","ITU-T_Y_oneM2M_DG_SEM","Martin Bauer, NEC","2017-08-21T08:41:46","Draft","INC",null,"TP 31"]
["TP-2017-0246R06","ITU-T_Y_oneM2M_Ind_DE","Hitachi","2017-08-21T11:41:51","Draft","INC",null,"TP 31"]
["TP-2017-0242R03","ITU-T_Y_oneM2M_FDC","Qualcomm Inc. (TIA)","2017-08-21T19:32:18","Draft","INC",null,"TP 31"]
["TP-2017-0244R02","ITU-T_Y_oneM2M_MAF_MEF","Qualcomm Inc. (TIA)","2017-08-21T19:33:48","Draft","INC",null,"TP 31"]
["TP-2017-0243R03","ITU-T_Y_oneM2M_SEC_SOL","Qualcomm Inc. (TIA)","2017-08-21T19:35:00","Draft","INC",null,"TP 31"]
["TP-2017-0259R01","ITU-T Y.oneM2M.HAIM","Huawei Technologies Co., Ltd.","2017-08-22T00:48:12","Draft","AG",null,"TP 31"]
["TP-2017-0259R02","ITU-T Y.oneM2M.HAIM","Huawei Technologies Co., Ltd.","2017-08-22T02:16:24","Draft","AG",null,"TP 31"]
["TP-2017-0256R01","ITU-T_Y_oneM2M_BO","NEC","2017-08-22T13:55:55","Draft","INC",null,"TP 31"]
["MAS-2017-0212R01","HAIM_modification_for_cookerFood_model","Qualcomm Inc. (TIA)","2017-08-29T04:19:44","Draft","CR",null,"MAS 31"]
["TST-2017-0221R01","Test specs release management","Miguel Angel Reina Ortega, ETSI","2017-08-30T15:02:32","Noted","INC",null,"TST 31"]
["ARC-2017-0345R01","clause10.2.4.9 table update","Convida","2017-08-31T14:52:09","Agreed","CR",null,"ARC 31"]
["ARC-2017-0184R03","StorageBasedEventClarification_R3","Convida","2017-08-31T14:56:36","Draft","CR",null,"ARC 31"]
["ARC-2017-0355","CR_SubGroupMapping","C-DOT & Huawei","2017-09-04T08:39:47","Draft","CR",null,"ARC 31"]
["ARC-2017-0356","DiscoveryProcedures_Corrections","C-DOT","2017-09-04T08:42:08","Agreed","CR",null,"ARC 31"]
["PRO-2017-0199","AERegistration_Request","C-DOT","2017-09-04T08:45:08","Noted","CR",null,"PRO 31"]
["PRO-2017-0200","CR_SubGroupMapping","C-DOT","2017-09-04T09:09:37","Draft","CR",null,"PRO 31"]
["TP-2017-0128R04","Draft_Release_2A_Control_Document","Roland Hechwartner, WPM Convenor","2017-09-04T15:52:41","Noted","INC",null,"TP 31"]
["PRO-2017-0201","mgmtObj_update","C-DOT","2017-09-05T09:37:07","Draft","CR",null,"PRO 31"]
["PRO-2017-0202","notificationForwardingURI_R3","C-DOT","2017-09-05T10:44:26","Draft","CR",null,"PRO 31"]
["PRO-2017-0203","discovery_warningInfo","C-DOT","2017-09-05T11:17:41","Noted","CR",null,"PRO 31"]
["PRO-2017-0206","mgmtObj_update_attributes_error","C-DOT","2017-09-06T04:38:04","Draft","CR",null,"PRO 31"]
["ARC-2017-0357","ContentSizeTimeInstance","C-DOT","2017-09-06T04:39:22","Draft","CR",null,"ARC 31"]
["ARC-2017-0358","PrimitiveContentOfRequestResource","C-DOT","2017-09-06T04:42:26","Draft","CR",null,"ARC 31"]
["PRO-2017-0207","CheckSupportedResourceType","C-DOT","2017-09-06T05:35:48","Draft","CR",null,"PRO 31"]
["PRO-2017-0208","ContentSizeTimeInstance","C-DOT","2017-09-06T05:37:19","Draft","CR",null,"PRO 31"]
["PRO-2017-0209","GroupMemberValidation","C-DOT","2017-09-06T05:38:52","Draft","CR",null,"PRO 31"]
["PRO-2017-0210","MaxInstanceAgeCI","C-DOT","2017-09-06T05:40:37","Draft","CR",null,"PRO 31"]
["PRO-2017-0211","PrimitiveContentOfRequestResource","C-DOT","2017-09-06T05:44:49","Draft","CR",null,"PRO 31"]
["PRO-2017-0212","SequenceNrTimeSeriesInstance","C-DOT","2017-09-06T05:46:16","Draft","CR",null,"PRO 31"]
["PRO-2017-0213","TimeSeriesInstanceCreate","C-DOT","2017-09-06T05:47:54","Draft","CR",null,"PRO 31"]
["TP-2017-0128R05","Draft_Release_2A_Control_Document","Roland Hechwartner, WPM Convenor","2017-09-06T09:10:21","Draft","INC",null,"TP 31"]
["PRO-2017-0209R01","GroupMemberValidation","C-DOT","2017-09-07T09:04:01","Draft","CR",null,"PRO 31"]
["PRO-2017-0208R01","ContentSizeTimeSeriesInstance","C-DOT","2017-09-07T09:17:22","Draft","CR",null,"PRO 31"]
["ARC-2017-0357R01","ContentSizeTimeSeriesInstance","C-DOT","2017-09-07T09:18:43","Draft","CR",null,"ARC 31"]
["ARC-2017-0359","ContentSizeTimeSeriesInstance-Mirror","C-DOT","2017-09-07T09:27:25","Draft","CR",null,"ARC 31"]
["ARC-2017-0360","PrimitiveContentOfRequestResource-Mirror","C-DOT","2017-09-07T09:28:48","Draft","CR",null,"ARC 31"]
["PRO-2017-0214","CheckSupportedResourceType-Mirror","C-DOT","2017-09-07T09:31:18","Draft","CR",null,"PRO 31"]
["PRO-2017-0215R01","ContentSizeTimeSeriesInstance-Mirror","C-DOT","2017-09-07T09:55:53","Draft","CR",null,"ARC 31"]
["PRO-2017-0216","GroupMemberValidation-Mirror","C-DOT","2017-09-07T09:57:16","Draft","CR",null,"PRO 31"]
["PRO-2017-0217","MaxInstanceAgeCI-Mirror","C-DOT","2017-09-07T09:58:32","Draft","CR",null,"PRO 31"]
["PRO-2017-0218","PrimitiveContentOfRequestResource-Mirror","C-DOT","2017-09-07T10:01:30","Draft","CR",null,"PRO 31"]
["PRO-2017-0219","SequenceNrTimeSeriesInstance-Mirror","C-DOT","2017-09-07T10:05:58","Draft","CR",null,"PRO 31"]
["PRO-2017-0220","TimeSeriesInstanceCreate-Mirror","C-DOT","2017-09-07T10:10:21","Draft","CR",null,"PRO 31"]
["SEC-2017-0128","New TR Baseline for WI 0073 App-ID Registry Function","Ian Deakin, iconectiv","2017-09-08T01:35:17","Draft","CR",null,"SEC 31"]
["PRO-2017-0226","action_shortName(R3)","C-DOT","2017-09-08T06:49:41","Draft","CR",null,"PRO 31"]
["PRO-2017-0227","mgmtCmd_update(normal)_R3","C-DOT","2017-09-08T06:50:25","Draft","CR",null,"PRO 31"]
["PRO-2017-0228","Resource_de-announcement_correction_R2","ZTE","2017-09-08T08:18:48","Draft","CR",null,"PRO 31"]
["PRO-2017-0229","Resource_de-announcement_correction_R3","ZTE","2017-09-08T08:22:09","Draft","CR",null,"PRO 31"]
["ARC-2017-0346R02","flexible_multicast_group_management_R3","ZTE","2017-09-08T08:25:27","Draft","CR",null,"ARC 31"]
["TP-2017-0260","New WI on Industrial Domain Information Model","Hitachi","2017-09-08T09:32:09","Noted","INC",null,"TP 31"]
["PRO-2017-0225","update to semanticDescriptor resource & procedure TS-0004 R3","Yongjing Zhang (Huawei)","2017-09-08T10:30:04","Noted","CR",null,"PRO 31"]
["PRO-2017-0224","semanticValidation resource & procedures TS-0004 R3","Yongjing Zhang (Huawei)","2017-09-08T10:30:19","Noted","CR",null,"PRO 31"]
["PRO-2017-0223","ontology resource & procedures TS-0004 R3","Yongjing Zhang (Huawei)","2017-09-08T10:30:31","Noted","CR",null,"PRO 31"]
["PRO-2017-0222","ontologyRepository resource & procedures TS-0004 R3","Yongjing Zhang (Huawei)","2017-09-08T10:30:43","Noted","CR",null,"PRO 31"]
["MAS-2017-0199R01","rewriting TS-0030-Generic-Interworking","NEC","2017-09-08T18:48:17","Noted","INC",null,"MAS 31"]
["MAS-2017-0200R01","changes to TS-0012 due to rewriting TS-0030-Generic-Interworking","NEC","2017-09-08T19:02:29","Noted","INC",null,"MAS 31"]
["ARC-2017-0363","GroupTimeOutForAggregatingMessages","Convida","2017-09-09T15:06:52","Draft","CR",null,"ARC 31"]
["PRO-2017-0232","RemoveGroupOfGroups","Convida","2017-09-09T15:39:28","Noted","CR",null,"PRO 31"]
["PRO-2017-0236","MQTTListeningTopicType","Convida","2017-09-09T18:14:41","Draft","CR",null,"PRO 31"]
["PRO-2017-0236R01","MQTTListeningTopicType","Convida","2017-09-09T18:18:49","Noted","CR",null,"PRO 31"]
["ARC-2017-0361","TS-0001 BDT correction","Convida","2017-09-09T18:46:46","Agreed","CR",null,"ARC 31"]
["ARC-2017-0362","TS-0001 clause 10.2.14 cleanup rel3","Convida, ZTE, NEC","2017-09-09T18:48:36","Noted","CR",null,"ARC 31"]
["PRO-2017-0231","TS-0004 BDT","Convida","2017-09-09T18:49:09","Draft","CR",null,"PRO 31"]
["PRO-2017-0237","MQTTRegistration","Convida","2017-09-09T18:49:10","Draft","CR",null,"PRO 31"]
["PRO-2017-0230","TS-0004 TP schedule node","Convida","2017-09-09T18:49:32","Draft","CR",null,"PRO 31"]
["ARC-2017-0365","accessControlObjectDetails","Convida","2017-09-09T19:32:48","Draft","CR",null,"ARC 31"]
["ARC-2017-0366","disableRetrievalDescription","Convida","2017-09-09T19:51:45","Draft","CR",null,"ARC 31"]
["PRO-2017-0238","disableRetrievalPresence","Convida","2017-09-10T00:18:57","Agreed","CR",null,"PRO 31"]
["ARC-2017-0367","Editorial Changes to crossResourceSubscription Resource","Convida","2017-09-10T01:33:42","Draft","INC",null,"ARC 31"]
["PRO-2017-0239","Cross Resource Subscription General Changes","Convida","2017-09-10T01:36:29","Noted","INC",null,"PRO 31"]
["PRO-2017-0240","Cross Resource Subscription Resource Description and Operations","Convida","2017-09-10T01:37:56","Noted","INC",null,"PRO 31"]
["PRO-2017-0241","Cross Resource Subscription Notification Procedure","Convida","2017-09-10T01:39:29","Noted","INC",null,"PRO 31"]
["ARC-2017-0370","expirationTime of CSEBase (R2)","KETI","2017-09-10T07:47:44","Noted","CR",null,"ARC 31"]
["ARC-2017-0371","expirationTime of CSEBase (R3)","KETI","2017-09-10T07:47:58","Draft","CR",null,"ARC 31"]
["ARC-2017-0372","clarification on child resource reference of Result Content (R2)","KETI","2017-09-10T07:48:13","Noted","CR",null,"ARC 31"]
["ARC-2017-0373","clarification on child resource reference of Result Content (R3)","KETI","2017-09-10T07:48:26","Draft","CR",null,"ARC 31"]
["ARC-2017-0374","Request with flexBlocking Rel-3","KT","2017-09-10T11:25:15","Draft","CR",null,"ARC 31"]
["ARC-2017-0375","Request with flexBlocking Rel-2","KT","2017-09-10T11:27:25","Draft","CR",null,"ARC 31"]
["PRO-2017-0242","timeSeries resource Rel-3","KT","2017-09-10T11:33:01","Noted","CR",null,"PRO 31"]
["PRO-2017-0243","Informational status-code mapping to CoAP Rel-2","KT","2017-09-10T11:35:49","Noted","CR",null,"PRO 31"]
["PRO-2017-0244","Informational status-code mapping to HTTP Rel-2","KT","2017-09-10T11:38:03","Agreed","CR",null,"PRO 31"]
["PRO-2017-0245","example of JSON serialization in TS-0004 Rel-3","KT","2017-09-10T11:40:17","Noted","CR",null,"PRO 31"]
["ARC-2017-0376","TS-0001_Release_Version_Handling","Convida","2017-09-10T12:30:14","Draft","CR",null,"ARC 31"]
["ARC-2017-0377","TS-0026_NIDD_Procedures","Convida","2017-09-10T12:37:19","Noted","CR",null,"ARC 31"]
["ARC-2017-0378","NIDD Discussion","Convida","2017-09-10T12:40:49","Noted","INC",null,"ARC 31"]
["TP-2017-0261","New WI Lightweight Services","Convida","2017-09-10T12:49:26","Noted","INC",null,"TP 31"]
["PRO-2017-0246","TS-0004-AE_Initiated_Triggering_R3","Convida","2017-09-10T13:18:49","Draft","CR",null,"PRO 31"]
["PRO-2017-0247","TS-0004_Transaction_Management_R3","Convida","2017-09-10T13:31:14","Draft","CR",null,"PRO 31"]
["ARC-2017-0379","TS-0001_Transaction_Management_Cleanup","Convida","2017-09-10T13:46:23","Draft","CR",null,"ARC 31"]
["ARC-2017-0380","TS-0001_NIDD_Support","Convida","2017-09-10T14:24:18","Draft","CR",null,"ARC 31"]
["ARC-2017-0381","filterConditionsDefinitions","Convida","2017-09-10T16:31:21","Draft","CR",null,"ARC 31"]
["ARC-2017-0382","GroupCreateFanoutPoint","Convida","2017-09-10T16:50:57","Draft","CR",null,"ARC 31"]
["ARC-2017-0383","New baseline for TS-0033 on Proximal IoT Interworking","Qualcomm Inc. (TIA)","2017-09-10T17:15:09","Noted","INC",null,"ARC 31"]
["PRO-2017-0248","RemoveGroupOfGroups-R2","Convida","2017-09-10T18:38:25","Noted","CR",null,"PRO 31"]
["PRO-2017-0249","DisableRetrievalPresence-R2","Convida","2017-09-10T18:45:14","Agreed","CR",null,"PRO 31"]
["ARC-2017-0384","disableRetrievalDescription-R2","Convida","2017-09-10T18:55:52","Draft","CR",null,"ARC 31"]
["ARC-2017-0385","filterConditionsDefinitions-R2","Convida","2017-09-10T19:54:37","Draft","CR",null,"ARC 31"]
["ARC-2017-0386","GroupCreateFanoutPoint-R2","Convida","2017-09-10T20:01:02","Draft","CR",null,"ARC 31"]
["TP-2017-0262","New WI Attribute Based Access Control Policy","Datang","2017-09-11T01:13:21","Noted","INC",null,"TP 31"]
["PRO-2017-0250","locationPolicy Enhancement-R2","Huawei Technologies Co., Ltd.","2017-09-11T01:25:56","Draft","CR",null,"PRO 31"]
["PRO-2017-0251","locationPolicy_Enhancement-R3","Huawei Technologies Co., Ltd.","2017-09-11T01:27:27","Draft","CR",null,"PRO 31"]
["PRO-2017-0252","Node Management","Huawei Technologies Co., Ltd.","2017-09-11T01:28:47","Draft","CR",null,"PRO 31"]
["MAS-2017-0221","semanticMashupInstance Resource Clarification","Convida","2017-09-11T01:37:46","Agreed","CR",null,"MAS 31"]
["PRO-2017-0235","Semantic Mashup in TS-0004","Convida","2017-09-11T01:38:16","Noted","CR",null,"PRO 31"]
["PRO-2017-0234","Semantic Content Support in TS-0004","Convida, NEC","2017-09-11T01:38:38","Noted","CR",null,"PRO 31"]
["PRO-2017-0233","Semantic Query Support in TS-0004","Convida, NEC","2017-09-11T01:38:53","Noted","CR",null,"PRO 31"]
["ARC-2017-0364","Cleanup on Resource Types Table For Semantic Mashup Resources","Convida","2017-09-11T01:40:34","Agreed","CR",null,"ARC 31"]
["MAS-2017-0222","New WI on Industrial Domain Information Model","Hitachi","2017-09-11T01:48:20","Noted","INC",null,"MAS 31"]
["ARC-2017-0387","TS-0001-Multicast Group Enhancement for MBMS","Huawei Technologies Co., Ltd.","2017-09-11T01:49:06","Noted","CR",null,"ARC 31"]
["ARC-2017-0388","TS-0026-3GPP MBMS Solution","Huawei Technologies Co., Ltd.","2017-09-11T01:50:43","Noted","CR",null,"ARC 31"]
["ARC-2017-0389","TS-0001 clause6 security description update R3","Datang","2017-09-11T01:53:21","Draft","CR",null,"ARC 31"]
["TST-2017-0227","Developer_Guide_of_3GPP_Interworking_Skeleton","Huawei Technologies Co., Ltd.","2017-09-11T01:54:01","Agreed","INC",null,"TST 31"]
["ARC-2017-0390","TS-0001 clause6 security description update mirror R2","Datang","2017-09-11T01:55:20","Draft","CR",null,"ARC 31"]
["ARC-2017-0368","discussion on multimediaSession resource","KETI, ntels","2017-09-11T02:50:00","Draft","INC",null,"ARC 31"]
["MAS-2017-0222R01","New WI on Industrial Domain Information Model","Hitachi","2017-09-11T03:06:28","Noted","INC",null,"MAS 31"]
["REQ-2017-0056","TS-0002-Requirements-V3_1_0","Huawei Technologies Co., Ltd.","2017-09-11T03:38:37","Draft","INC",null,"REQ 31"]
["MAS-2017-0223","Adding support managing gallery device","BOE","2017-09-11T06:14:56","Noted","CR",null,"MAS 31"]
["PRO-2017-0253","update_table_about_token","NTT","2017-09-11T07:12:28","Noted","CR",null,"PRO 31"]
["PRO-2017-0254","update_table_about_token_MIRROR_R3","NTT","2017-09-11T07:14:47","Noted","CR",null,"PRO 31"]
["ARC-2017-0391","modification of access mode for deviceInfo","NTT","2017-09-11T07:22:07","Noted","INC",null,"ARC 31"]
["PRO-2017-0255","absRelTimestamp_mismatch","NTT","2017-09-11T08:32:59","Noted","INC",null,"PRO 31"]
["PRO-2017-0199R01","AERegistration_Request","C-DOT","2017-09-11T10:00:42","Agreed","CR",null,"PRO 31"]
["SEC-2017-0129","Revision of PPM for Rel3","KDDI","2017-09-11T12:41:34","Draft","CR",null,"SEC 31"]
["PRO-2017-0256","Service_Layer_Forwarding_R3","Convida","2017-09-11T14:57:37","Draft","CR",null,"PRO 31"]
["TST-2017-0228","semanticInterop-R2","Convida","2017-09-11T20:17:51","Draft","CR",null,"TST 31"]
["ARC-2017-0392","TS-0001 deleting the virtual attribute R2 Mirror","BOE","2017-09-12T02:49:47","Draft","CR",null,"ARC 31"]
["ARC-2017-0393","TS-0001 deleting the virtual attribute R3","BOE","2017-09-12T02:51:31","Draft","CR",null,"ARC 31"]
["ARC-2017-0394","Clarification_on_registration(R3)","C-DOT","2017-09-12T05:26:38","Draft","CR",null,"ARC 31"]
["PRO-2017-0257","TS-0009_content_location(R2)","C-DOT","2017-09-12T05:27:50","Noted","CR",null,"PRO 31"]
["PRO-2017-0258","AERegistration_Request(R2)","C-DOT","2017-09-12T06:58:18","Agreed","CR",null,"PRO 31"]
["PRO-2017-0259","FanoutpointValidation(R3)","C-DOT","2017-09-12T07:00:02","Draft","CR",null,"PRO 31"]
["PRO-2017-0260","FanoutpointValidation(R2)","C-DOT","2017-09-12T07:01:18","Draft","CR",null,"PRO 31"]
["TP-2017-0263","Work Program Status TP#31 opening","WPM Convenor, Roland Hechwartner","2017-09-12T12:12:34","Noted","STR",null,"TP 31"]
["MAS-2017-0224","MAS#31 Agenda","Yongjing Zhang (Huawei, MAS Chair)","2017-09-12T13:12:50","Noted","AG",null,"MAS 31"]
["MAS-2017-0225","MAS#31 Doc Allocation","Yongjing Zhang (Huawei, MAS Chair)","2017-09-12T13:13:03","Noted","AG",null,"MAS 31"]
["ARC-2017-0395","requestAggregationForPollingChannel-R3","Convida","2017-09-12T18:41:52","Draft","CR",null,"ARC 31"]
["PRO-2017-0261","RequestAggregationForPollingChannel_R3","Convida","2017-09-12T20:13:05","Draft","CR",null,"PRO 31"]
["PRO-2017-0256R01","Service_Layer_Forwarding_R3","Convida","2017-09-12T20:16:52","Noted","CR",null,"PRO 31"]
["PRO-2017-0261R01","RequestAggregationForPollingChannel_R3","Convida","2017-09-12T20:26:27","Draft","CR",null,"PRO 31"]
["TST-2017-0229","TS-0017_new_baseline_v_0_1_0","KETI","2017-09-13T02:49:02","Agreed","INC",null,"TST 31"]
["TST-2017-0230","TS-0018_new_baseline_v_0_5_0","KETI","2017-09-13T02:51:17","Agreed","INC",null,"TST 31"]
["TST-2017-0231","TS-0018_Changes_from_STF531","Miguel Angel Reina Ortega, ETSI","2017-09-13T07:08:15","Agreed","CR",null,"TST 31"]
["TP-2017-0240","Weekly Schedule TP31","Karen Hughes, ETSI","2017-09-13T07:22:36","Noted","INC",null,"TP 31"]
["TP-2017-0264","LS on Status of work on Northbound APIs for SCEF-SCSAS Interworking","3GPP CT","2017-09-13T08:46:41","Noted","LS",null,"TP 31"]
["TST-2017-0232","Final corrections of SDT-IPE DvprGuide","Maciej Goluch (Orange)","2017-09-13T09:56:14","Noted","CR",null,"TST 31"]
["TP-2017-0265","change requests to oneM2M specifications - ITU-T","Omar Elloumi, TP Chair","2017-09-13T10:23:19","Draft","LS",null,"TP 31"]
["TST-2017-0233","TR-0045 Baseline after editHelp","NEC","2017-09-13T13:46:01","Agreed","INC",null,"TST 31"]
["TST-2017-0234","Added_missing_descriptorRepresentation_attribute_in_TR-0045","NEC","2017-09-13T14:28:03","Noted","CR",null,"TST 31"]
["SEC-2017-0130","App-ID Registry Function TR intro","iconectiv","2017-09-13T15:34:41","Draft","INC",null,"SEC 31"]
["SEC-2017-0131","App-ID Registry Function TR use case 1","iconectiv","2017-09-13T15:36:04","Draft","AG",null,"SEC 31"]
["SEC-2017-0132","App-ID Registry Function TR use case 2","iconectiv","2017-09-13T15:36:40","Draft","INC",null,"SEC 31"]
["SEC-2017-0133","App-ID Registry Function TR use case 1","iconecitv","2017-09-13T15:38:36","Withdrawn","INC",null,"SEC 31"]
["SEC-2017-0134","App-ID Registry Function TR use case 3","iconectiv","2017-09-13T15:39:18","Draft","INC",null,"SEC 31"]
["SEC-2017-0135","App-ID Registry Function TR use case 4","iconectiv","2017-09-13T15:40:27","Draft","INC",null,"SEC 31"]
["SEC-2017-0136","App-ID Registry Function TR use case 5","iconectiv","2017-09-13T15:57:24","Draft","INC",null,"SEC 31"]
["MAS-2017-0199R02","rewriting TS-0030-Generic-Interworking","NEC","2017-09-13T17:31:18","Noted","INC",null,"MAS 31"]
["MAS-2017-0226","Added semantic check aspects in semantic validation","KT","2017-09-13T20:46:14","Noted","CR",null,"MAS 31"]
["TP-2017-0262R01","New WI Attribute Based Access Control Policy","Datang","2017-09-14T01:12:53","Noted","INC",null,"TP 31"]
["PRO-2017-0262","Required IANA registrations for oneM2M PRO specs","Qualcomm Inc. (TIA)","2017-09-14T07:26:35","Noted","INC",null,"PRO 31"]
["PRO-2017-0263","mgmtObj_update_MIRROR_R2","C-DOT","2017-09-14T08:39:23","Draft","CR",null,"PRO 31"]
["PRO-2017-0264","mgmtObj_update_attributes_error_MIRROR_R2","C-DOT","2017-09-14T08:41:42","Draft","CR",null,"PRO 31"]
["PRO-2017-0265","mgmtObj_correction","C-DOT","2017-09-14T08:44:01","Draft","CR",null,"PRO 31"]
["PRO-2017-0266","mgmtObj_correction_MIRROR_R2","C-DOT","2017-09-14T08:45:44","Draft","CR",null,"PRO 31"]
["PRO-2017-0267","mgmtObj_firmware_procedures_R3","C-DOT","2017-09-14T08:46:32","Draft","CR",null,"PRO 31"]
["PRO-2017-0268","mgmtObj_firmware_procedures_MIRROR_R2","C-DOT","2017-09-14T08:47:41","Draft","CR",null,"PRO 31"]
["MAS-2017-0227","TS-0006-mgmtCmd_execResult(R3)","C-DOT","2017-09-14T11:43:08","Draft","CR",null,"MAS 31"]
["MAS-2017-0228","TS-0006-mgmtCmd_execResult(R2)","C-DOT","2017-09-14T11:44:57","Draft","CR",null,"MAS 31"]
["ARC-2017-0388R01","TS-0026-3GPP MBMS Solution","Huawei Technologies Co., Ltd.","2017-09-14T12:35:55","Noted","CR",null,"ARC 31"]
["ARC-2017-0387R01","TS-0001-Multicast Group Enhancement for MBMS","Huawei Technologies Co., Ltd.","2017-09-14T12:36:37","Noted","CR",null,"ARC 31"]
["TST-2017-0235","New_baseline_of_TR-0034_after_editHelp","Shane HE, Nokia","2017-09-14T13:07:37","Agreed","INC",null,"TST 31"]
["TP-2017-0240R01","Weekly Schedule TP31","Karen Hughes, ETSI","2017-09-14T14:08:32","Noted","INC",null,"TP 31"]
["MAS-2017-0225R01","MAS#31 Doc Allocation","Yongjing Zhang (Huawei, MAS Chair)","2017-09-15T07:40:10","Noted","AG",null,"MAS 31"]
["SEC-2017-0137","SEC 31 F2F meeting Agenda","WG Chair (Gemalto)","2017-09-15T08:24:44","Noted","AG",null,"SEC 31"]
["ARC-2017-0396","eventNotificationCriteria_childResourceType(R3)","C-DOT","2017-09-15T08:43:22","Draft","CR",null,"ARC 31"]
["PRO-2017-0207R01","CheckSupportedResourceType","C-DOT","2017-09-15T08:56:17","Draft","CR",null,"PRO 31"]
["PRO-2017-0208R02","ContentSizeTimeSeriesInstance","C-DOT","2017-09-15T08:57:50","Draft","CR",null,"PRO 31"]
["PRO-2017-0210R01","MaxInstanceAgeCI","C-DOT","2017-09-15T08:58:38","Draft","CR",null,"PRO 31"]
["PRO-2017-0211R01","PrimitiveContentOfRequestResource","C-DOT","2017-09-15T08:59:43","Agreed","CR",null,"PRO 31"]
["PRO-2017-0213R01","TimeSeriesInstanceCreate","C-DOT","2017-09-15T09:00:30","Draft","CR",null,"PRO 31"]
["PRO-2017-0214R01","CheckSupportedResourceType-Mirror","C-DOT","2017-09-15T09:01:05","Draft","CR",null,"PRO 31"]
["PRO-2017-0215R02","ContentSizeTimeSeriesInstance-Mirror","C-DOT","2017-09-15T09:02:18","Draft","CR",null,"PRO 31"]
["PRO-2017-0217R01","MaxInstanceAgeCI-Mirror","C-DOT","2017-09-15T09:03:08","Draft","CR",null,"PRO 31"]
["PRO-2017-0218R01","PrimitiveContentOfRequestResource-Mirror","C-DOT","2017-09-15T09:04:34","Noted","CR",null,"PRO 31"]
["PRO-2017-0220R01","TimeSeriesInstanceCreate-Mirror","C-DOT","2017-09-15T09:05:14","Draft","CR",null,"PRO 31"]
["ARC-2017-0357R02","ContentSizeTimeSeriesInstance","C-DOT","2017-09-15T09:07:36","Draft","CR",null,"ARC 31"]
["ARC-2017-0358R01","PrimitiveContentOfRequestResource","C-DOT","2017-09-15T09:08:22","Draft","CR",null,"ARC 31"]
["ARC-2017-0397","missing_assignedTokenIdentifier_response(R3)","C-DOT","2017-09-15T09:08:25","Draft","CR",null,"ARC 31"]
["ARC-2017-0359R01","ContentSizeTimeSeriesInstance-Mirror","C-DOT","2017-09-15T09:09:39","Draft","CR",null,"ARC 31"]
["ARC-2017-0360R01","PrimitiveContentOfRequestResource-Mirror","C-DOT","2017-09-15T09:10:24","Draft","CR",null,"ARC 31"]
["PRO-2017-0269","authorSignReqInfo_correction(R3)","C-DOT","2017-09-15T09:12:39","Draft","CR",null,"PRO 31"]
["ARC-2017-0398","AERegistrationOnIN-CSE(R3).doc","C-DOT","2017-09-15T09:32:30","Draft","CR",null,"ARC 31"]
["TST-2017-0236","TS-0019-ATS-Baseline-V0_4_0","Miguel Angel Reina Ortega, ETSI","2017-09-15T10:02:45","Agreed","INC",null,"TST 31"]
["ARC-2017-0399","AERegistrationOnIN-CSE(R2)","C-DOT","2017-09-15T10:49:31","Draft","CR",null,"ARC 31"]
["SEC-2017-0138","CR TR-0038 Security Developers Guide Cleanup","Gemalto","2017-09-15T12:52:57","Draft","CR",null,"SEC 31"]
["SEC-2017-0137R01","SEC 31 F2F meeting Agenda","WG Chair (Gemalto)","2017-09-15T16:43:49","Draft","AG",null,"SEC 31"]
["SEC-2017-0139","TS-0016_CR_SE-Resource","G+D","2017-09-15T17:42:43","Draft","CR",null,"SEC 31"]
["REQ-2017-0057","REQ 31 Doc Allocation","Shelby Kiewel, WG1 Chairman, iconectiv","2017-09-15T21:21:21","Draft","AG",null,"REQ 31"]
["REQ-2017-0058","REQ31 Agenda","Shelby Kiewel, WG1 Chairman, iconectiv","2017-09-15T21:30:35","Draft","AG",null,"REQ 31"]
["PRO-2017-0271","action_shortName(R2)","C-DOT","2017-09-16T13:16:31","Draft","CR",null,"PRO 31"]
["PRO-2017-0272","CR_SubGroupMapping(R2)","C-DOT","2017-09-16T13:20:45","Draft","CR",null,"PRO 31"]
["PRO-2017-0273","discovery_warningInfo(R2)","C-DOT","2017-09-16T13:22:50","Draft","CR",null,"PRO 31"]
["PRO-2017-0274","mgmtCmd_update(normal)_R2","C-DOT","2017-09-16T13:26:23","Draft","CR",null,"PRO 31"]
["TST-2017-0237","CR-TS-0013 update test descriptions for flexContainer","TTA (Heejin Joung)","2017-09-16T13:32:52","Agreed","CR",null,"TST 31"]
["ARC-2017-0400","CR_SubGroupMapping(R2)","C-DOT & Huawei","2017-09-16T14:05:31","Draft","CR",null,"ARC 31"]
["ARC-2017-0401","Clarification_on_registration(R2)","C-DOT","2017-09-16T14:08:23","Draft","CR",null,"ARC 31"]
["ARC-2017-0402","DiscoveryProcedures_Corrections(R2)","C-DOT","2017-09-16T14:09:51","Noted","CR",null,"ARC 31"]
["PRO-2017-0210R02","MaxInstanceAgeCI","C-DOT","2017-09-16T14:15:20","Noted","CR",null,"PRO 31"]
["PRO-2017-0209R02","GroupMemberValidation","C-DOT","2017-09-16T14:23:18","Agreed","CR",null,"PRO 31"]
["PRO-2017-0213R02","TimeSeriesInstanceCreate","C-DOT","2017-09-16T14:24:41","Draft","CR",null,"PRO 31"]
["PRO-2017-0216R01","GroupMemberValidation-Mirror","C-DOT","2017-09-16T14:26:20","Agreed","CR",null,"PRO 31"]
["PRO-2017-0217R02","MaxInstanceAgeCI-Mirror","C-DOT","2017-09-16T14:26:58","Noted","CR",null,"PRO 31"]
["PRO-2017-0220R02","TimeSeriesInstanceCreate-Mirror","C-DOT","2017-09-16T14:27:50","Draft","CR",null,"PRO 31"]
["TST-2017-0238","TST 31 Agenda","TST Chair (KETI)","2017-09-17T04:16:27","Noted","AG",null,"TST 31"]
["TST-2017-0239","TST 31 docs allocation","TST Chair (KETI)","2017-09-17T05:06:52","Noted","AG",null,"TST 31"]
["TST-2017-0238R01","TST 31 Agenda","TST Chair (KETI)","2017-09-17T05:07:21","Agreed","AG",null,"TST 31"]
["ARC-2017-0404","ARC31_Document_Allocation","ARC VC","2017-09-17T06:34:34","Noted","INC",null,"ARC 31"]
["ARC-2017-0403","ARC_31_Meeting_Agenda","ARC VC","2017-09-17T06:50:44","Agreed","INC",null,"ARC 31"]
["TP-2017-0267","ARC30x_TS-0001_CR_Pack","ARC VC","2017-09-17T09:18:46","Approved","INC",null,"TP 31"]
["TP-2017-0262R02","New WI Attribute Based Access Control Policy","Datang","2017-09-17T09:27:26","Noted","INC",null,"TP 31"]
["ARC-2017-0377R01","TS-0026_NIDD_Procedures","Convida","2017-09-17T10:06:23","Draft","CR",null,"ARC 31"]
["TP-2017-0239","Agenda TP31","Omar Elloumi, Nokia","2017-09-17T12:18:12","Noted","AG",null,"TP 31"]
["MAS-2017-0231","HAIM_Mapping_OMA_DWAPI_3DP_data_type","ETRI, HERIT","2017-09-17T12:21:56","Noted","CR",null,"MAS 31"]
["MAS-2017-0230","HAIM_Mapping_OMA_DWAPI_3DP_dev_model","ETRI, HERIT","2017-09-17T12:22:14","Noted","CR",null,"MAS 31"]
["MAS-2017-0229","HAIM_Mapping_OMA_DWAPI_introduction","ETRI, HERIT","2017-09-17T12:22:28","Noted","CR",null,"MAS 31"]
["SEC-2017-0140","CR TS-0003 new ECC","Orange","2017-09-17T13:06:49","Draft","CR",null,"SEC 31"]
["TP-2017-0240R02","Weekly Schedule TP31","Karen Hughes, ETSI","2017-09-17T14:03:19","Noted","INC",null,"TP 31"]
["TP-2017-0240R03","Weekly Schedule TP31","Karen Hughes, ETSI","2017-09-17T14:12:54","Noted","INC",null,"TP 31"]
["PRO-2017-0270","Agenda PRO31","PRO WG Chair","2017-09-17T14:20:59","Noted","AG",null,"PRO 31"]
["TP-2017-0240R04","Weekly Schedule TP31","Karen Hughes, ETSI","2017-09-17T14:26:59","Noted","INC",null,"TP 31"]
["TP-2017-0268","Transposition of oneM2M TS/TR to ITU-T SG20","Omar Elloumi, Shane He, Peter Kim","2017-09-17T16:22:34","Draft","INC",null,"TP 31"]
["TP-2017-0239R01","Agenda TP31","Omar Elloumi, Nokia","2017-09-17T17:07:19","Noted","AG",null,"TP 31"]
["SEC-2017-0141","TS003 editorial changes","Orange","2017-09-17T17:11:04","Draft","CR",null,"SEC 31"]
["SEC-2017-0142","Annex L enhancement","Orange","2017-09-17T19:53:38","Draft","CR",null,"SEC 31"]
["TP-2017-0269","SEC30x_TS-0003_CR_Pack_R3","Qualcomm (Rapporteur)","2017-09-17T21:02:24","Approved","INC",null,"TP 31"]
["TP-2017-0260R01","New WI on Industrial Domain Information Model","Hitachi","2017-09-18T00:56:48","Noted","INC",null,"TP 31"]
["TP-2017-0262R03","New WI Attribute Based Access Control Policy","Datang","2017-09-18T01:14:37","Noted","INC",null,"TP 31"]
["TP-2017-0261R01","New WI Lightweight Services","Convida","2017-09-18T01:35:23","Noted","INC",null,"TP 31"]
["TP-2017-0239R02","Agenda TP31","Omar Elloumi, Nokia","2017-09-18T01:39:33","Noted","AG",null,"TP 31"]
["TP-2017-0260R02","New WI on Industrial Domain Information Model","Hitachi","2017-09-18T02:48:16","Noted","INC",null,"TP 31"]
["TP-2017-0239R03","Agenda TP31","Omar Elloumi, Nokia","2017-09-18T03:04:52","Agreed","AG",null,"TP 31"]
["TP-2017-0240R05","Weekly Schedule TP31","Karen Hughes, ETSI","2017-09-18T03:17:32","Noted","INC",null,"TP 31"]
["TP-2017-0262R04","New WI Attribute Based Access Control Policy","Datang","2017-09-18T03:26:25","Noted","INC",null,"TP 31"]
["ARC-2017-0404R01","ARC31_Document_Allocation","ARC VC","2017-09-18T04:47:15","Agreed","INC",null,"ARC 31"]
["ARC-2017-0359R02","ContentSizeTimeSeriesInstance-Mirror","C-DOT","2017-09-18T05:09:31","Draft","CR",null,"ARC 31"]
["MAS-2017-0222R02","New WI on Industrial Domain Information Model","Hitachi","2017-09-18T05:26:26","Noted","INC",null,"MAS 31"]
["ARC-2017-0341R01","ScheduleResourceEditorialCleanup","Convida","2017-09-18T05:27:24","Draft","CR",null,"ARC 31"]
["ARC-2017-0383R01","New baseline for TS-0033 on Proximal IoT Interworking","Qualcomm Inc. (TIA)","2017-09-18T05:31:37","Agreed","INC",null,"ARC 31"]
["ARC-2017-0405","StorageBasedEventClarification_R2","Convida","2017-09-18T05:33:10","Draft","CR",null,"ARC 31"]
["MAS-2017-0226R01","Added semantic check aspects in semantic validation","KT","2017-09-18T08:06:27","Noted","CR",null,"MAS 31"]
["PRO-2017-0213R03","TimeSeriesInstanceCreate","C-DOT","2017-09-18T08:17:21","Draft","CR",null,"PRO 31"]
["PRO-2017-0220R03","TimeSeriesInstanceCreate-Mirror","C-DOT","2017-09-18T08:23:06","Draft","CR",null,"PRO 31"]
["PRO-2017-0200R01","CR_SubGroupMapping","C-DOT","2017-09-18T08:52:20","Draft","CR",null,"PRO 31"]
["MAS-2017-0224R01","MAS#31 Agenda","Yongjing Zhang (Huawei, MAS Chair)","2017-09-18T09:39:25","Agreed","AG",null,"MAS 31"]
["MAS-2017-0225R02","MAS#31 Doc Allocation","Yongjing Zhang (Huawei, MAS Chair)","2017-09-18T09:40:43","Noted","AG",null,"MAS 31"]
["ARC-2017-0402R01","DiscoveryProcedures_Corrections(R2)","C-DOT","2017-09-18T10:03:54","Agreed","CR",null,"ARC 31"]
["PRO-2017-0245R01","example of JSON serialization in TS-0004 Rel-3","KT","2017-09-18T10:16:31","Agreed","CR",null,"PRO 31"]
["PRO-2017-0242R01","timeSeries resource Rel-3","KT","2017-09-18T10:32:27","Draft","CR",null,"PRO 31"]
["TP-2017-0266","Enabling Blockchain to oneM2M","KETI","2017-09-18T12:13:08","Draft","INC",null,"TP 31"]
["TST-2017-0232R01","Final corrections of SDT-IPE DvprGuide","Maciej Goluch (Orange)","2017-09-18T12:28:14","Agreed","CR",null,"TST 31"]
["ARC-2017-0362R01","TS-0001 clause 10.2.14 cleanup rel3","Convida, ZTE, NEC","2017-09-18T13:10:23","Draft","CR",null,"ARC 31"]
["TP-2017-0240R06","Weekly Schedule TP31","Karen Hughes, ETSI","2017-09-18T13:26:09","Noted","INC",null,"TP 31"]
["TP-2017-0262R05","New WI Attribute Based Access Control Policy","Datang","2017-09-18T15:07:37","Agreed","INC",null,"TP 31"]
["MAS-2017-0225R03","MAS#31 Doc Allocation","Yongjing Zhang (Huawei, MAS Chair)","2017-09-18T16:02:56","Noted","AG",null,"MAS 31"]
["ARC-2017-0376R01","TS-0001_Release_Version_Handling","Convida","2017-09-18T16:25:43","Noted","CR",null,"ARC 31"]
["TP-2017-0261R02","New WI Lightweight Services","Convida","2017-09-18T16:55:20","Draft","INC",null,"TP 31"]
["PRO-2017-0275","timeSeries resource Rel-2","KT","2017-09-18T23:15:38","Draft","CR",null,"PRO 31"]
["PRO-2017-0243R01","Informational status-code mapping to CoAP Rel-2","KT","2017-09-19T00:29:33","Draft","CR",null,"PRO 31"]
["ARC-2017-0390R01","TS-0001 clause6 security description update mirror R2","Datang","2017-09-19T02:17:48","Draft","CR",null,"ARC 31"]
["ARC-2017-0389R01","TS-0001 clause6 security description update R3","Datang","2017-09-19T02:18:21","Draft","CR",null,"ARC 31"]
["ARC-2017-0404R02","ARC31_Document_Allocation","ARC VC","2017-09-19T02:27:30","Draft","INC",null,"ARC 31"]
["TP-2017-0270","Request Approval of TR-0026 v0.10.1","Shelby Kiewel, WG1 Chairman, iconectiv","2017-09-19T04:54:31","Approved","INC",null,"TP 31"]
["MAS-2017-0230R01","HAIM_Mapping_OMA_DWAPI_3DP_dev_model","ETRI, HERIT","2017-09-19T05:15:17","Noted","CR",null,"MAS 31"]
["MAS-2017-0200R02","changes to TS-0012 due to rewriting TS-0030-Generic-Interworking","NEC","2017-09-19T05:53:00","Noted","INC",null,"MAS 31"]
["PRO-2017-0222R01","ontologyRepository resource & procedures TS-0004 R3","Yongjing Zhang (Huawei)","2017-09-19T06:08:32","Noted","CR",null,"PRO 31"]
["TP-2017-0240R07","Weekly Schedule TP31","Karen Hughes, ETSI","2017-09-19T07:43:03","Noted","INC",null,"TP 31"]
["MAS-2017-0200R03","changes to TS-0012 due to rewriting TS-0030-Generic-Interworking","NEC","2017-09-19T07:45:50","Agreed","INC",null,"MAS 31"]
["ARC-2017-0389R02","TS-0001 clause6 security description update R3","Datang","2017-09-19T09:07:46","Draft","CR",null,"ARC 31"]
["ARC-2017-0390R02","TS-0001 clause6 security description update mirror R2","Datang","2017-09-19T09:08:16","Draft","CR",null,"ARC 31"]
["TP-2017-0260R03","New WI on Industrial Domain Information Model","Hitachi","2017-09-19T09:36:14","Draft","INC",null,"TP 31"]
["TST-2017-0240","semantic_testing_proposal","Easy Global Market","2017-09-19T09:41:44","Draft","INC",null,"TST 31"]
["MAS-2017-0199R03","rewriting TS-0030-Generic-Interworking","NEC","2017-09-19T10:32:04","Noted","INC",null,"MAS 31"]
["MAS-2017-0226R02","Added semantic check aspects in semantic validation","KT","2017-09-19T11:07:34","Noted","CR",null,"MAS 31"]
["ARC-2017-0390R03","TS-0001 clause6 security description update mirror R2","Datang","2017-09-19T11:37:38","Draft","CR",null,"ARC 31"]
["TP-2017-0240R08","Weekly Schedule TP31","Karen Hughes, ETSI","2017-09-19T12:37:43","Noted","INC",null,"TP 31"]
["TST-2017-0234R01","Added_missing_descriptorRepresentation_attribute_in_TR-0045","NEC","2017-09-19T13:35:51","Noted","CR",null,"TST 31"]
["ARC-2017-0376R02","TS-0001_Release_Version_Handling","Convida","2017-09-19T14:05:35","Draft","CR",null,"ARC 31"]
["ARC-2017-0406","TS-0001_Release_Version_Handling(R2)","Convida","2017-09-19T14:07:07","Draft","CR",null,"ARC 31"]
["ARC-2017-0407","short name for semanticValidation virtual resource TS-0001 R3","Yongjing Zhang (Huawei)","2017-09-19T16:16:53","Draft","CR",null,"ARC 31"]
["PRO-2017-0222R02","ontologyRepository resource & procedures TS-0004 R3","Yongjing Zhang (Huawei)","2017-09-19T16:18:09","Agreed","CR",null,"PRO 31"]
["PRO-2017-0223R01","ontology resource & procedures TS-0004 R3","Yongjing Zhang (Huawei)","2017-09-19T16:18:50","Noted","CR",null,"PRO 31"]
["PRO-2017-0224R01","semanticValidation resource & procedures TS-0004 R3","Yongjing Zhang (Huawei)","2017-09-19T16:19:18","Agreed","CR",null,"PRO 31"]
["PRO-2017-0225R01","update to semanticDescriptor resource & procedure TS-0004 R3","Yongjing Zhang (Huawei)","2017-09-19T16:19:43","Noted","CR",null,"PRO 31"]
["MAS-2017-0225R04","MAS#31 Doc Allocation","Yongjing Zhang (Huawei, MAS Chair)","2017-09-19T17:01:40","Draft","AG",null,"MAS 31"]
["TP-2017-0128R06","Draft_Release_2A_Control_Document","Roland Hechwartner, WPM Convenor","2017-09-19T19:46:52","Draft","INC",null,"TP 31"]
["TST-2017-0242","allow_TTCN-3_tool_extensions","Easy Global Market","2017-09-19T23:25:40","Noted","INC",null,"TST 31"]
["PRO-2017-0242R02","timeSeries resource Rel-3","KT","2017-09-19T23:33:26","Noted","CR",null,"PRO 31"]
["PRO-2017-0276","execInstance resource Rel-3","KT","2017-09-20T00:24:19","Draft","CR",null,"PRO 31"]
["PRO-2017-0277","m2mServiceSubscriptionProfile resource Rel-3","KT","2017-09-20T00:50:08","Draft","CR",null,"PRO 31"]
["PRO-2017-0278","semanticDescriptor resource Rel-3","KT","2017-09-20T01:12:38","Draft","CR",null,"PRO 31"]
["PRO-2017-0279","notificationTargetMgmtPolicyRef resource Rel-3","KT","2017-09-20T03:34:39","Draft","CR",null,"PRO 31"]
["PRO-2017-0280","policyDeletionRules resource Rel-3","KT","2017-09-20T03:53:58","Draft","CR",null,"PRO 31"]
["TP-2017-0240R09","Weekly Schedule TP31","Karen Hughes, ETSI","2017-09-20T04:18:11","Noted","INC",null,"TP 31"]
["TP-2017-0240R10","Weekly Schedule TP31","Karen Hughes, ETSI","2017-09-20T04:46:52","Noted","INC",null,"TP 31"]
["MAS-2017-0232","WI-0063 update and rename to Ontology based Interworking","NEC","2017-09-20T05:02:32","Noted","INC",null,"MAS 31"]
["PRO-2017-0185R01","CoAP Content-Format ID","QUALCOMM Inc. (TIA)","2017-09-20T05:45:27","Agreed","CR",null,"PRO 31"]
["ARC-2017-0408","clause10.2.4.9 table update R2","Convida Wireless","2017-09-20T06:09:16","Draft","CR",null,"ARC 31"]
["ARC-2017-0409","short name for mashup resource","Convida","2017-09-20T06:22:36","Draft","CR",null,"ARC 31"]
["PRO-2017-0281","execInstance resource Rel-2","KT","2017-09-20T07:17:33","Draft","CR",null,"PRO 31"]
["PRO-2017-0282","serviceSubscribedNode resource Rel-2","KT","2017-09-20T07:19:22","Draft","CR",null,"PRO 31"]
["PRO-2017-0283","notificationTargetMgmtPolicyRef resource Rel-2","KT","2017-09-20T07:22:02","Draft","CR",null,"PRO 31"]
["PRO-2017-0284","notificationTargetPolicy resource Rel-2","KT","2017-09-20T07:24:12","Draft","CR",null,"PRO 31"]
["PRO-2017-0285","policyDeletionRules resource Rel-2","KT","2017-09-20T07:26:01","Draft","CR",null,"PRO 31"]
["PRO-2017-0286","semanticDescriptor resource Rel-2","KT","2017-09-20T07:27:32","Draft","CR",null,"PRO 31"]
["TP-2017-0239R04","Agenda TP31","Omar Elloumi, Nokia","2017-09-20T09:46:00","Noted","AG",null,"TP 31"]
["TP-2017-0260R04","New WI on Industrial Domain Information Model","Hitachi","2017-09-20T10:45:20","Draft","INC",null,"TP 31"]
["TP-2017-0277","Planning of oneM2M-IIC Workshop","Huawei Technologies","2017-09-20T11:31:32","Draft","INC",null,"TP 31"]
["TP-2017-0239R05","Agenda TP31","Omar Elloumi, Nokia","2017-09-20T11:32:25","Draft","AG",null,"TP 31"]
["PRO-2017-0233R01","Semantic Query Support in TS-0004","Convida, NEC","2017-09-20T11:44:35","Agreed","CR",null,"PRO 31"]
["PRO-2017-0235R01","Semantic Mashup in TS-0004","Convida","2017-09-20T11:45:28","Noted","CR",null,"PRO 31"]
["TST-2017-0242R01","allow_TTCN-3_tool_extensions","Easy Global Market","2017-09-20T15:04:46","Noted","INC",null,"TST 31"]
["TST-2017-0234R02","Added_missing_descriptorRepresentation_attribute_in_TR-0045","NEC","2017-09-20T15:45:36","Noted","CR",null,"TST 31"]
["PRO-2017-0250R01","locationPolicy Enhancement-R2","Huawei Technologies Co., Ltd.","2017-09-20T16:07:13","Draft","CR",null,"PRO 31"]
["PRO-2017-0251R01","locationPolicy_Enhancement-R3","Huawei Technologies Co., Ltd.","2017-09-20T16:08:26","Draft","CR",null,"PRO 31"]
["ARC-2017-0377R02","TS-0026_NIDD_Procedures","Convida","2017-09-20T18:52:00","Draft","CR",null,"ARC 31"]
["ARC-2017-0380R01","TS-0001_NIDD_Support","Convida","2017-09-20T18:52:46","Draft","CR",null,"ARC 31"]
["PRO-2017-0270R01","Agenda PRO31","PRO WG Chair","2017-09-20T19:00:17","Draft","AG",null,"PRO 31"]
["ARC-2017-0376R03","TS-0001_Release_Version_Handling","Convida","2017-09-20T20:28:27","Draft","CR",null,"ARC 31"]
["ARC-2017-0406R01","TS-0001_Release_Version_Handling(R2)","Convida","2017-09-20T20:28:53","Draft","CR",null,"ARC 31"]
["ARC-2017-0404R03","ARC31_Document_Allocation","ARC VC","2017-09-20T20:40:32","Draft","INC",null,"ARC 31"]
["TP-2017-0240R11","Weekly Schedule TP31","Karen Hughes, ETSI","2017-09-21T02:51:00","Draft","INC",null,"TP 31"]
["TP-2017-0278","Reply LS to Broadband Forum on USP","Timothy Carey, Nokia","2017-09-21T02:52:55","Draft","LS",null,"TP 31"]
["TP-2017-0260R05","New WI on Industrial Domain Information Model","Hitachi","2017-09-21T03:20:04","Draft","INC",null,"TP 31"]
["PRO-2017-0203R01","discovery_warningInfo","C-DOT","2017-09-21T03:21:56","Draft","CR",null,"PRO 31"]
["PRO-2017-0202R01","notificationForwardingURI_R3","C-DOT","2017-09-21T03:22:43","Draft","CR",null,"PRO 31"]
["TR-0026","Vehicular_Domain_Enablement",null,"2017-09-21T03:28:56","Approved","TR","v0.10.1","TP 31"]
["TST-2017-0234R03","Added_missing_descriptorRepresentation_attribute_in_TR-0045","NEC (Convida)","2017-09-21T03:49:16","Noted","CR",null,"TST 31"]
["TST-2017-0234R04","Added_missing_descriptorRepresentation_attribute_in_TR-0045","NEC (Convida)","2017-09-21T03:56:59","Agreed","CR",null,"TST 31"]
["PRO-2017-0250R02","locationPolicy Enhancement-R2","Huawei Technologies Co., Ltd.","2017-09-21T03:58:05","Noted","CR",null,"PRO 31"]
["PRO-2017-0251R02","locationPolicy_Enhancement-R3","Huawei Technologies Co., Ltd.","2017-09-21T03:59:42","Agreed","CR",null,"PRO 31"]
["TST-2017-0239R01","TST 31 docs allocation","TST Chair (KETI)","2017-09-21T04:00:03","Draft","AG",null,"TST 31"]
["PRO-2017-0252R01","Node Management","Huawei Technologies Co., Ltd.","2017-09-21T04:00:28","Draft","CR",null,"PRO 31"]
["MAS-2017-0229R01","HAIM_Mapping_OMA_DWAPI_introduction","ETRI, HERIT","2017-09-21T04:23:06","Noted","CR",null,"MAS 31"]
["TST-2017-0243","TR-0045_Baseline_v0.3.1","NEC","2017-09-21T05:06:49","Draft","INC",null,"TST 31"]
["MAS-2017-0231R01","HAIM_Mapping_OMA_DWAPI_3DP_data_type","ETRI, HERIT","2017-09-21T05:30:07","Agreed","CR",null,"MAS 31"]
["MAS-2017-0230R02","HAIM_Mapping_OMA_DWAPI_3DP_dev_model","ETRI, HERIT","2017-09-21T05:30:29","Agreed","CR",null,"MAS 31"]
["PRO-2017-0239R01","Cross Resource Subscription General Changes","Convida","2017-09-21T05:34:58","Draft","INC",null,"PRO 31"]
["MAS-2017-0229R02","HAIM_Mapping_OMA_DWAPI_introduction","ETRI, HERIT","2017-09-21T06:03:12","Noted","CR",null,"MAS 31"]
["MAS-2017-0199R04","rewriting TS-0030-Generic-Interworking","NEC","2017-09-21T06:08:39","Agreed","INC",null,"MAS 31"]
["MAS-2017-0229R03","HAIM_Mapping_OMA_DWAPI_introduction","ETRI, HERIT","2017-09-21T06:16:18","Agreed","CR",null,"MAS 31"]
["MAS-2017-0226R03","Added semantic check aspects in semantic validation","KT","2017-09-21T06:31:38","Draft","CR",null,"MAS 31"]
["TST-2017-0244","Preparation_of_ TS-0018_v1_0_0","Miguel Angel Reina Ortega, ETSI","2017-09-21T07:22:40","Draft","CR",null,"TST 31"]
["TST-2017-0241","TR-0039 Baseline v0.0.5 after TST31","Maciej Goluch (Orange)","2017-09-21T08:01:07","Draft","CR",null,"TST 31"]
["PRO-2017-0200R02","CR_SubGroupMapping","C-DOT","2017-09-21T10:00:57","Agreed","CR",null,"PRO 31"]
["PRO-2017-0256R02","Service_Layer_Forwarding_R3","Convida","2017-09-21T10:19:28","Draft","CR",null,"PRO 31"]
["PRO-2017-0253R01","update_table_about_token","NTT","2017-09-21T10:35:37","Agreed","CR",null,"PRO 31"]
["PRO-2017-0254R01","update_table_about_token_MIRROR_R3","NTT","2017-09-21T10:36:20","Agreed","CR",null,"PRO 31"]
["PRO-2017-0250R03","locationPolicy Enhancement-R2","Huawei Technologies Co., Ltd.","2017-09-21T10:41:27","Agreed","CR",null,"PRO 31"]
["PRO-2017-0242R03","timeSeries resource Rel-3","KT","2017-09-21T10:44:29","Draft","CR",null,"PRO 31"]
["PRO-2017-0272R01","CR_SubGroupMapping(R2)","C-DOT","2017-09-21T10:49:04","Draft","CR",null,"PRO 31"]
["PRO-2017-0257R01","TS-0009_content_location(R2)","C-DOT","2017-09-21T10:51:12","Agreed","CR",null,"PRO 31"]
["PRO-2017-0287","example of JSON serialization in TS-0004 Rel-2 Mirror","KT","2017-09-21T10:53:33","Draft","CR",null,"PRO 31"]
["PRO-2017-0202R02","notificationForwardingURI_R3","C-DOT","2017-09-21T11:04:15","Noted","CR",null,"PRO 31"]
["PRO-2017-0218R02","PrimitiveContentOfRequestResource-Mirror","C-DOT","2017-09-21T11:07:07","Agreed","CR",null,"PRO 31"]
["PRO-2017-0210R03","MaxInstanceAgeCI","C-DOT","2017-09-21T11:09:47","Agreed","CR",null,"PRO 31"]
["PRO-2017-0217R03","MaxInstanceAgeCI-Mirror","C-DOT","2017-09-21T11:12:49","Agreed","CR",null,"PRO 31"]
["PRO-2017-0288","PRO-2017-0288-m2m_status_mgmtObj_R3","C-DOT","2017-09-21T11:53:37","Draft","CR",null,"PRO 31"]
["PRO-2017-0289","PRO-2017-0289-m2m_status_mgmtObj_MIRROR_R2","C-DOT","2017-09-21T11:57:31","Draft","CR",null,"PRO 31"]
["PRO-2017-0227R01","mgmtCmd_update(normal)_R3","C-DOT","2017-09-21T12:07:20","Agreed","CR",null,"PRO 31"]
["PRO-2017-0225R02","update to semanticDescriptor resource & procedure TS-0004 R3","Yongjing Zhang (Huawei)","2017-09-21T12:09:11","Agreed","CR",null,"PRO 31"]
["PRO-2017-0223R02","ontology resource & procedures TS-0004 R3","Yongjing Zhang (Huawei)","2017-09-21T12:12:47","Agreed","CR",null,"PRO 31"]
["PRO-2017-0243R02","Informational status-code mapping to CoAP Rel-2","KT","2017-09-21T12:17:31","Draft","CR",null,"PRO 31"]
["PRO-2017-0274R01","mgmtCmd_update(normal)_R2","C-DOT","2017-09-21T12:23:27","Draft","CR",null,"PRO 31"]
["TP-2017-0279","MAS WG5 report at TP#31","Yongjing Zhang (Huawei, MAS Chair)",null,"Draft","STR",null,"TP 31"]
["TP-2017-0276","WI-0063 update and rename to Ontology based Interworking","NEC",null,"Draft","INC",null,"TP 31"]
["TP-2017-0275","TS-0010_Rel-2_CR_Pack","PRO WG Vice-chair (Nobu Uchida)",null,"Draft","INC",null,"TP 31"]
["TP-2017-0274","TS-0009_Rel-2_CR_Pack","PRO WG Vice-chair (Nobu Uchida)",null,"Draft","INC",null,"TP 31"]
["TP-2017-0273","TS-0008_Rel-2_CR_Pack","PRO WG Vice-chair (Nobu Uchida)",null,"Draft","INC",null,"TP 31"]
["TP-2017-0272","TS-0004_Rel-3_CR_Pack","PRO WG Vice-chair (Nobu Uchida)",null,"Draft","INC",null,"TP 31"]
["TP-2017-0271","TS-0004_Rel-2_CR_Pack","PRO WG Vice-chair (Nobu Uchida)",null,"Draft","INC",null,"TP 31"]
["PRO-2017-0215","ContentSizeTimeSeriesInstance-Mirror","C-DOT",null,"Draft","CR",null,"ARC 31"]
["ARC-2017-0369","CR on multimediaSession resource type and procedures","KETI, ntels",null,"Draft","CR",null,"ARC 31"]

{"sheet":"TP","index":3,"n_rows":143,"n_cols":8,"rows_kept":143,"cut":false,"hidden":false,"merged":[]}
["SHORT DOC NB","SHORTNAME","SOURCE","UPLOADED","STATUS","DOC TYPE","VERS","MEETING"]
["TP-2017-0232","User Services Platform specification available for review","Broadband Forum","2017-07-28T07:37:06","Noted","LS",null,"TP 31"]
["TP-2017-0234","ITU-T Y.oneM2M.DM.BBF","Timothy Carey, Nokia","2017-07-28T15:52:52","Draft","INC",null,"TP 31"]
["TP-2017-0233","ITU-T Y.oneM2M.IWK.LwM2M","Timothy Carey, Nokia","2017-07-28T15:53:16","Draft","INC",null,"TP 31"]
["TP-2017-0234R01","ITU-T Y.oneM2M.DM.BBF","Timothy Carey, Nokia","2017-07-31T13:06:49","Draft","INC",null,"TP 31"]
["TP-2017-0233R01","ITU-T Y.oneM2M.IWK.LwM2M","Timothy Carey, Nokia","2017-07-31T13:07:16","Draft","INC",null,"TP 31"]
["TP-2017-0128R03","Draft_Release_2A_Control_Document","Roland Hechwartner, WPM Convenor","2017-07-31T13:19:42","Draft","INC",null,"TP 31"]
["TP-2017-0235","ITU-T_Y_oneM2M_CT","Roland Hechwartner, Deutsche Telekom","2017-07-31T13:36:35","Draft","INC",null,"TP 31"]
["TP-2017-0233R02","ITU-T Y.oneM2M.IWK.LwM2M","Timothy Carey, Nokia","2017-07-31T13:45:55","Draft","INC",null,"TP 31"]
["TP-2017-0234R02","ITU-T Y.oneM2M.DM.BBF","Timothy Carey, Nokia","2017-07-31T13:46:21","Draft","INC",null,"TP 31"]
["TP-2017-0236","ITU Y.oneM2M.UCC","Convida, KDDI","2017-07-31T14:16:27","Draft","CR",null,"TP 31"]
["TP-2017-0234R03","ITU-T Y.oneM2M.DM.BBF","Timothy Carey, Nokia","2017-08-02T10:22:47","Draft","INC",null,"TP 31"]
["TP-2017-0233R03","ITU-T Y.oneM2M.IWK.LwM2M","Timothy Carey, Nokia","2017-08-02T10:23:33","Draft","INC",null,"TP 31"]
["TP-2017-0236R01","ITU-T Y.oneM2M.UCC","Convida, KDDI, Nokia","2017-08-02T12:27:21","Draft","CR",null,"TP 31"]
["TP-2017-0236R02","ITU-T Y.oneM2M.UCC","Convida, KDDI, Nokia","2017-08-04T15:28:16","Draft","CR",null,"TP 31"]
["TP-2017-0233R04","ITU-T Y.oneM2M.IWK.LwM2M","Timothy Carey, Nokia","2017-08-08T18:05:11","Draft","INC",null,"TP 31"]
["TP-2017-0234R04","ITU-T Y.oneM2M.DM.BBF","Timothy Carey, Nokia","2017-08-08T18:05:36","Draft","INC",null,"TP 31"]
["TP-2017-0237","ITU-T Y.oneM2M.SLCP","Nobu Uchida, QUALCOMM","2017-08-10T04:51:49","Draft","INC",null,"TP 31"]
["TP-2017-0241","ITU-T Y.oneM2M.PB.WebSocket","Nobu Uchida, QUALCOMM","2017-08-10T06:32:48","Draft","INC",null,"TP 31"]
["TP-2017-0237R01","ITU-T Y.oneM2M.SLCP","Nobu Uchida, QUALCOMM","2017-08-10T06:40:05","Draft","INC",null,"TP 31"]
["TP-2017-0235R01","ITU-T_Y_oneM2M_CT","Roland Hechwartner, Deutsche Telekom","2017-08-10T09:14:15","Draft","INC",null,"TP 31"]
["TP-2017-0242","ITU-T_Y_oneM2M_FDC","Qualcomm Inc. (TIA)","2017-08-10T18:23:29","Draft","INC",null,"TP 31"]
["TP-2017-0245","Voting List for TP31","Karen Hughes, Secretariat","2017-08-11T08:45:51","Agreed","INC",null,"TP 31"]
["TP-2017-0246","ITU-T_Y_oneM2M_Ind_DE","Hitachi","2017-08-11T09:09:18","Draft","INC",null,"TP 31"]
["TP-2017-0247","ITU-T Y.oneM2M.PB.MQTT","MQTT Rapporteur","2017-08-11T16:04:26","Draft","INC",null,"TP 31"]
["TP-2017-0248","ITU-T_Y_oneM2M_DG_SEM","Martin Bauer, NEC","2017-08-12T20:53:38","Draft","INC",null,"TP 31"]
["TP-2017-0244","ITU-T_Y_oneM2M_MAF_MEF","Qualcomm Inc. (TIA)","2017-08-14T00:52:42","Draft","INC",null,"TP 31"]
["TP-2017-0243","ITU-T_Y_oneM2M_SEC_SOL","Qualcomm Inc. (TIA)","2017-08-14T00:53:37","Draft","INC",null,"TP 31"]
["TP-2017-0242R01","ITU-T_Y_oneM2M_FDC","Qualcomm Inc. (TIA)","2017-08-14T00:54:43","Draft","INC",null,"TP 31"]
["TP-2017-0246R01","ITU-T_Y_oneM2M_Ind_DE","Hitachi","2017-08-14T05:53:02","Draft","INC",null,"TP 31"]
["TP-2017-0249","ITU-T_Y_oneM2M_DG_CoAP","Shane HE, Nokia","2017-08-14T08:50:27","Draft","INC",null,"TP 31"]
["TP-2017-0250","ITU-T_Y_oneM2M_ARC","ZTE","2017-08-14T09:13:04","Draft","INC",null,"TP 31"]
["TP-2017-0243R01","ITU-T_Y_oneM2M_SEC_SOL","Qualcomm Inc. (TIA)","2017-08-14T11:50:53","Draft","INC",null,"TP 31"]
["TP-2017-0234R05","ITU-T Y.oneM2M.DM.BBF","Timothy Carey, Nokia","2017-08-14T13:44:18","Draft","INC",null,"TP 31"]
["TP-2017-0233R05","ITU-T Y.oneM2M.IWK.LwM2M","Timothy Carey, Nokia","2017-08-14T13:44:47","Draft","INC",null,"TP 31"]
["TP-2017-0242R02","ITU-T_Y_oneM2M_FDC","Qualcomm Inc. (TIA)","2017-08-14T15:02:38","Draft","INC",null,"TP 31"]
["TP-2017-0241R01","ITU-T Y.oneM2M.PB.WebSocket","Nobu Uchida, QUALCOMM","2017-08-14T15:16:40","Draft","INC",null,"TP 31"]
["TP-2017-0247R01","ITU-T Y.oneM2M.PB.MQTT","MQTT Rapporteur","2017-08-14T15:45:30","Draft","INC",null,"TP 31"]
["TP-2017-0241R02","ITU-T Y.oneM2M.PB.WebSocket","Nobu Uchida, QUALCOMM","2017-08-14T15:54:27","Draft","INC",null,"TP 31"]
["TP-2017-0243R02","ITU-T_Y_oneM2M_SEC_SOL","Qualcomm Inc. (TIA)","2017-08-14T16:21:24","Draft","INC",null,"TP 31"]
["TP-2017-0244R01","ITU-T_Y_oneM2M_MAF_MEF","Qualcomm Inc. (TIA)","2017-08-14T16:22:08","Draft","INC",null,"TP 31"]
["TP-2017-0236R03","ITU-T Y.oneM2M.UCC","Convida, KDDI, Nokia","2017-08-14T17:57:33","Draft","CR",null,"TP 31"]
["TP-2017-0237R02","ITU-T Y.oneM2M.SLCP","Nobu Uchida, QUALCOMM","2017-08-14T18:21:03","Draft","INC",null,"TP 31"]
["TP-2017-0182R06","ITU-T Y.oneM2M.REQ","Huawei Technologies Co., Ltd.","2017-08-15T06:27:53","Draft","INC",null,"TP 31"]
["TP-2017-0236R04","ITU-T Y.oneM2M.UCC","Convida, KDDI, Nokia","2017-08-15T14:44:05","Draft","CR",null,"TP 31"]
["TP-2017-0237R03","ITU-T Y.oneM2M.SLCP","Nobu Uchida, QUALCOMM","2017-08-15T21:36:17","Draft","INC",null,"TP 31"]
["TP-2017-0241R03","ITU-T Y.oneM2M.PB.WebSocket","Nobu Uchida, QUALCOMM","2017-08-15T21:41:07","Draft","INC",null,"TP 31"]
["TP-2017-0251","ITU-T Y.oneM2M.DG.DM","Huawei Technologies Co., Ltd.","2017-08-16T10:59:40","Draft","INC",null,"TP 31"]
["TP-2017-0252","ITU-T Y.oneM2M.DM.OMA","Huawei Technologies Co., Ltd.","2017-08-16T11:02:27","Draft","INC",null,"TP 31"]
["TP-2017-0253","ITU-T Y.oneM2M.PB.COAP","Huawei Technologies Co., Ltd.","2017-08-16T11:04:53","Draft","INC",null,"TP 31"]
["TP-2017-0254","ITU-T Y.oneM2M.TF","Huawei Technologies Co., Ltd.","2017-08-16T11:07:10","Draft","INC",null,"TP 31"]
["TP-2017-0246R02","ITU-T_Y_oneM2M_Ind_DE","Hitachi","2017-08-17T01:16:04","Draft","INC",null,"TP 31"]
["TP-2017-0250R01","ITU-T_Y_oneM2M_ARC","ZTE","2017-08-17T03:43:04","Draft","INC",null,"TP 31"]
["TP-2017-0255","ITU-T Y.oneM2M.PB.HTTP","KETI","2017-08-17T05:06:10","Draft","INC",null,"TP 31"]
["TP-2017-0254R01","ITU-T Y.oneM2M.TF","Huawei Technologies Co., Ltd.","2017-08-17T06:41:57","Draft","INC",null,"TP 31"]
["TP-2017-0253R01","ITU-T Y.oneM2M.PB.COAP","Huawei Technologies Co., Ltd.","2017-08-17T06:42:28","Draft","INC",null,"TP 31"]
["TP-2017-0252R01","ITU-T Y.oneM2M.DM.OMA","Huawei Technologies Co., Ltd.","2017-08-17T06:42:52","Draft","INC",null,"TP 31"]
["TP-2017-0251R01","ITU-T Y.oneM2M.DG.DM","Huawei Technologies Co., Ltd.","2017-08-17T06:43:15","Draft","INC",null,"TP 31"]
["TP-2017-0255R01","ITU-T Y.oneM2M.PB.HTTP","KETI","2017-08-17T08:56:16","Draft","INC",null,"TP 31"]
["TP-2017-0256","ITU-T_Y_oneM2M_BO","NEC","2017-08-17T12:54:08","Draft","INC",null,"TP 31"]
["TP-2017-0255R02","ITU-T Y.oneM2M.PB.HTTP","KETI","2017-08-18T05:56:40","Draft","INC",null,"TP 31"]
["TP-2017-0251R02","ITU-T Y.oneM2M.DG.DM","Huawei Technologies Co., Ltd.","2017-08-18T06:03:29","Draft","INC",null,"TP 31"]
["TP-2017-0252R02","ITU-T Y.oneM2M.DM.OMA","Huawei Technologies Co., Ltd.","2017-08-18T06:03:50","Draft","INC",null,"TP 31"]
["TP-2017-0253R02","ITU-T Y.oneM2M.PB.COAP","Huawei Technologies Co., Ltd.","2017-08-18T06:04:08","Draft","INC",null,"TP 31"]
["TP-2017-0254R02","ITU-T Y.oneM2M.TF","Huawei Technologies Co., Ltd.","2017-08-18T06:04:29","Draft","INC",null,"TP 31"]
["TP-2017-0246R03","ITU-T_Y_oneM2M_Ind_DE","Hitachi","2017-08-18T09:36:49","Draft","INC",null,"TP 31"]
["TP-2017-0182R07","ITU-T Y.oneM2M.REQ","Huawei Technologies Co., Ltd.","2017-08-18T10:31:22","Draft","INC",null,"TP 31"]
["TP-2017-0235R02","ITU-T_Y_oneM2M_CT","Roland Hechwartner, Deutsche Telekom","2017-08-18T12:45:50","Draft","INC",null,"TP 31"]
["TP-2017-0182R08","ITU-T Y.oneM2M.REQ","Huawei Technologies Co., Ltd.","2017-08-18T13:19:44","Draft","INC",null,"TP 31"]
["TP-2017-0257","ITU-T_Y.oneM2M.DG.AppDev","Laurent Velez, ETSI","2017-08-18T15:23:53","Draft","INC",null,"TP 31"]
["TP-2017-0258","Y.oneM2M.InteropTest","Laurent Velez, ETSI","2017-08-18T16:40:38","Draft","INC",null,"TP 31"]
["TP-2017-0258R01","ITU-T_Y_oneM2M_InteropTest","Laurent Velez, ETSI","2017-08-18T16:44:34","Draft","INC",null,"TP 31"]
["TP-2017-0257R01","ITU-T_Y.oneM2M.DG.AppDev","Laurent Velez, ETSI","2017-08-18T16:47:37","Draft","INC",null,"TP 31"]
["TP-2017-0233R06","ITU-T Y.oneM2M.IWK.LwM2M","Timothy Carey, Nokia","2017-08-20T11:58:34","Draft","INC",null,"TP 31"]
["TP-2017-0234R06","ITU-T Y.oneM2M.DM.BBF","Timothy Carey, Nokia","2017-08-20T12:01:29","Draft","INC",null,"TP 31"]
["TP-2017-0257R02","ITU-T_Y.oneM2M.DG.AppDev","Laurent Velez, ETSI","2017-08-20T13:24:09","Draft","INC",null,"TP 31"]
["TP-2017-0258R02","ITU-T_Y_oneM2M_InteropTest","Laurent Velez, ETSI","2017-08-20T13:24:58","Draft","INC",null,"TP 31"]
["TP-2017-0246R04","ITU-T_Y_oneM2M_Ind_DE","Hitachi","2017-08-21T01:56:05","Draft","INC",null,"TP 31"]
["TP-2017-0247R02","ITU-T Y.oneM2M.PB.MQTT","MQTT Rapporteur","2017-08-21T02:31:00","Draft","INC",null,"TP 31"]
["TP-2017-0246R05","ITU-T_Y_oneM2M_Ind_DE","Hitachi","2017-08-21T05:32:06","Draft","INC",null,"TP 31"]
["TP-2017-0259","ITU-T Y.oneM2M.HAIM","Huawei Technologies Co., Ltd.","2017-08-21T07:55:46","Draft","AG",null,"TP 31"]
["TP-2017-0248R01","ITU-T_Y_oneM2M_DG_SEM","Martin Bauer, NEC","2017-08-21T08:41:46","Draft","INC",null,"TP 31"]
["TP-2017-0246R06","ITU-T_Y_oneM2M_Ind_DE","Hitachi","2017-08-21T11:41:51","Draft","INC",null,"TP 31"]
["TP-2017-0242R03","ITU-T_Y_oneM2M_FDC","Qualcomm Inc. (TIA)","2017-08-21T19:32:18","Draft","INC",null,"TP 31"]
["TP-2017-0244R02","ITU-T_Y_oneM2M_MAF_MEF","Qualcomm Inc. (TIA)","2017-08-21T19:33:48","Draft","INC",null,"TP 31"]
["TP-2017-0243R03","ITU-T_Y_oneM2M_SEC_SOL","Qualcomm Inc. (TIA)","2017-08-21T19:35:00","Draft","INC",null,"TP 31"]
["TP-2017-0259R01","ITU-T Y.oneM2M.HAIM","Huawei Technologies Co., Ltd.","2017-08-22T00:48:12","Draft","AG",null,"TP 31"]
["TP-2017-0259R02","ITU-T Y.oneM2M.HAIM","Huawei Technologies Co., Ltd.","2017-08-22T02:16:24","Draft","AG",null,"TP 31"]
["TP-2017-0256R01","ITU-T_Y_oneM2M_BO","NEC","2017-08-22T13:55:55","Draft","INC",null,"TP 31"]
["TP-2017-0128R04","Draft_Release_2A_Control_Document","Roland Hechwartner, WPM Convenor","2017-09-04T15:52:41","Noted","INC",null,"TP 31"]
["TP-2017-0128R05","Draft_Release_2A_Control_Document","Roland Hechwartner, WPM Convenor","2017-09-06T09:10:21","Draft","INC",null,"TP 31"]
["TP-2017-0260","New WI on Industrial Domain Information Model","Hitachi","2017-09-08T09:32:09","Noted","INC",null,"TP 31"]
["TP-2017-0261","New WI Lightweight Services","Convida","2017-09-10T12:49:26","Noted","INC",null,"TP 31"]
["TP-2017-0262","New WI Attribute Based Access Control Policy","Datang","2017-09-11T01:13:21","Noted","INC",null,"TP 31"]
["TP-2017-0263","Work Program Status TP#31 opening","WPM Convenor, Roland Hechwartner","2017-09-12T12:12:34","Noted","STR",null,"TP 31"]
["TP-2017-0240","Weekly Schedule TP31","Karen Hughes, ETSI","2017-09-13T07:22:36","Noted","INC",null,"TP 31"]
["TP-2017-0264","LS on Status of work on Northbound APIs for SCEF-SCSAS Interworking","3GPP CT","2017-09-13T08:46:41","Noted","LS",null,"TP 31"]
["TP-2017-0265","change requests to oneM2M specifications - ITU-T","Omar Elloumi, TP Chair","2017-09-13T10:23:19","Draft","LS",null,"TP 31"]
["TP-2017-0262R01","New WI Attribute Based Access Control Policy","Datang","2017-09-14T01:12:53","Noted","INC",null,"TP 31"]
["TP-2017-0240R01","Weekly Schedule TP31","Karen Hughes, ETSI","2017-09-14T14:08:32","Noted","INC",null,"TP 31"]
["TP-2017-0267","ARC30x_TS-0001_CR_Pack","ARC VC","2017-09-17T09:18:46","Approved","INC",null,"TP 31"]
["TP-2017-0262R02","New WI Attribute Based Access Control Policy","Datang","2017-09-17T09:27:26","Noted","INC",null,"TP 31"]
["TP-2017-0239","Agenda TP31","Omar Elloumi, Nokia","2017-09-17T12:18:12","Noted","AG",null,"TP 31"]
["TP-2017-0240R02","Weekly Schedule TP31","Karen Hughes, ETSI","2017-09-17T14:03:19","Noted","INC",null,"TP 31"]
["TP-2017-0240R03","Weekly Schedule TP31","Karen Hughes, ETSI","2017-09-17T14:12:54","Noted","INC",null,"TP 31"]
["TP-2017-0240R04","Weekly Schedule TP31","Karen Hughes, ETSI","2017-09-17T14:26:59","Noted","INC",null,"TP 31"]
["TP-2017-0268","Transposition of oneM2M TS/TR to ITU-T SG20","Omar Elloumi, Shane He, Peter Kim","2017-09-17T16:22:34","Draft","INC",null,"TP 31"]
["TP-2017-0239R01","Agenda TP31","Omar Elloumi, Nokia","2017-09-17T17:07:19","Noted","AG",null,"TP 31"]
["TP-2017-0269","SEC30x_TS-0003_CR_Pack_R3","Qualcomm (Rapporteur)","2017-09-17T21:02:24","Approved","INC",null,"TP 31"]
["TP-2017-0260R01","New WI on Industrial Domain Information Model","Hitachi","2017-09-18T00:56:48","Noted","INC",null,"TP 31"]
["TP-2017-0262R03","New WI Attribute Based Access Control Policy","Datang","2017-09-18T01:14:37","Noted","INC",null,"TP 31"]
["TP-2017-0261R01","New WI Lightweight Services","Convida","2017-09-18T01:35:23","Noted","INC",null,"TP 31"]
["TP-2017-0239R02","Agenda TP31","Omar Elloumi, Nokia","2017-09-18T01:39:33","Noted","AG",null,"TP 31"]
["TP-2017-0260R02","New WI on Industrial Domain Information Model","Hitachi","2017-09-18T02:48:16","Noted","INC",null,"TP 31"]
["TP-2017-0239R03","Agenda TP31","Omar Elloumi, Nokia","2017-09-18T03:04:52","Agreed","AG",null,"TP 31"]
["TP-2017-0240R05","Weekly Schedule TP31","Karen Hughes, ETSI","2017-09-18T03:17:32","Noted","INC",null,"TP 31"]
["TP-2017-0262R04","New WI Attribute Based Access Control Policy","Datang","2017-09-18T03:26:25","Noted","INC",null,"TP 31"]
["TP-2017-0266","Enabling Blockchain to oneM2M","KETI","2017-09-18T12:13:08","Draft","INC",null,"TP 31"]
["TP-2017-0240R06","Weekly Schedule TP31","Karen Hughes, ETSI","2017-09-18T13:26:09","Noted","INC",null,"TP 31"]
["TP-2017-0262R05","New WI Attribute Based Access Control Policy","Datang","2017-09-18T15:07:37","Agreed","INC",null,"TP 31"]
["TP-2017-0261R02","New WI Lightweight Services","Convida","2017-09-18T16:55:20","Draft","INC",null,"TP 31"]
["TP-2017-0270","Request Approval of TR-0026 v0.10.1","Shelby Kiewel, WG1 Chairman, iconectiv","2017-09-19T04:54:31","Approved","INC",null,"TP 31"]
["TP-2017-0240R07","Weekly Schedule TP31","Karen Hughes, ETSI","2017-09-19T07:43:03","Noted","INC",null,"TP 31"]
["TP-2017-0260R03","New WI on Industrial Domain Information Model","Hitachi","2017-09-19T09:36:14","Draft","INC",null,"TP 31"]
["TP-2017-0240R08","Weekly Schedule TP31","Karen Hughes, ETSI","2017-09-19T12:37:43","Noted","INC",null,"TP 31"]
["TP-2017-0128R06","Draft_Release_2A_Control_Document","Roland Hechwartner, WPM Convenor","2017-09-19T19:46:52","Draft","INC",null,"TP 31"]
["TP-2017-0240R09","Weekly Schedule TP31","Karen Hughes, ETSI","2017-09-20T04:18:11","Noted","INC",null,"TP 31"]
["TP-2017-0240R10","Weekly Schedule TP31","Karen Hughes, ETSI","2017-09-20T04:46:52","Noted","INC",null,"TP 31"]
["TP-2017-0239R04","Agenda TP31","Omar Elloumi, Nokia","2017-09-20T09:46:00","Noted","AG",null,"TP 31"]
["TP-2017-0260R04","New WI on Industrial Domain Information Model","Hitachi","2017-09-20T10:45:20","Draft","INC",null,"TP 31"]
["TP-2017-0277","Planning of oneM2M-IIC Workshop","Huawei Technologies","2017-09-20T11:31:32","Draft","INC",null,"TP 31"]
["TP-2017-0239R05","Agenda TP31","Omar Elloumi, Nokia","2017-09-20T11:32:25","Draft","AG",null,"TP 31"]
["TP-2017-0240R11","Weekly Schedule TP31","Karen Hughes, ETSI","2017-09-21T02:51:00","Draft","INC",null,"TP 31"]
["TP-2017-0278","Reply LS to Broadband Forum on USP","Timothy Carey, Nokia","2017-09-21T02:52:55","Draft","LS",null,"TP 31"]
["TP-2017-0260R05","New WI on Industrial Domain Information Model","Hitachi","2017-09-21T03:20:04","Draft","INC",null,"TP 31"]
["TR-0026","Vehicular_Domain_Enablement",null,"2017-09-21T03:28:56","Approved","TR","v0.10.1","TP 31"]
["TP-2017-0279","MAS WG5 report at TP#31","Yongjing Zhang (Huawei, MAS Chair)",null,"Draft","STR",null,"TP 31"]
["TP-2017-0276","WI-0063 update and rename to Ontology based Interworking","NEC",null,"Draft","INC",null,"TP 31"]
["TP-2017-0275","TS-0010_Rel-2_CR_Pack","PRO WG Vice-chair (Nobu Uchida)",null,"Draft","INC",null,"TP 31"]
["TP-2017-0274","TS-0009_Rel-2_CR_Pack","PRO WG Vice-chair (Nobu Uchida)",null,"Draft","INC",null,"TP 31"]
["TP-2017-0273","TS-0008_Rel-2_CR_Pack","PRO WG Vice-chair (Nobu Uchida)",null,"Draft","INC",null,"TP 31"]
["TP-2017-0272","TS-0004_Rel-3_CR_Pack","PRO WG Vice-chair (Nobu Uchida)",null,"Draft","INC",null,"TP 31"]
["TP-2017-0271","TS-0004_Rel-2_CR_Pack","PRO WG Vice-chair (Nobu Uchida)",null,"Draft","INC",null,"TP 31"]

{"sheet":"REQ","index":4,"n_rows":6,"n_cols":8,"rows_kept":6,"cut":false,"hidden":false,"merged":[]}
["SHORT DOC NB","SHORTNAME","SOURCE","UPLOADED","STATUS","DOC TYPE","VERS","MEETING"]
["REQ-2017-0054","CR_TS-0011_Security_Principal","Qualcomm Inc. (TIA)","2017-07-14T16:34:36","Draft","CR",null,"REQ 31"]
["REQ-2017-0055","Draft-TR-0026-Vehicular_Domain_Enablement_v_0_10_1","KDDI, Convida, Huawei Technologies","2017-08-11T06:26:10","Agreed","CR",null,"REQ 31"]
["REQ-2017-0056","TS-0002-Requirements-V3_1_0","Huawei Technologies Co., Ltd.","2017-09-11T03:38:37","Draft","INC",null,"REQ 31"]
["REQ-2017-0057","REQ 31 Doc Allocation","Shelby Kiewel, WG1 Chairman, iconectiv","2017-09-15T21:21:21","Draft","AG",null,"REQ 31"]
["REQ-2017-0058","REQ31 Agenda","Shelby Kiewel, WG1 Chairman, iconectiv","2017-09-15T21:30:35","Draft","AG",null,"REQ 31"]

{"sheet":"ARC","index":5,"n_rows":95,"n_cols":8,"rows_kept":95,"cut":false,"hidden":false,"merged":[]}
["SHORT DOC NB","SHORTNAME","SOURCE","UPLOADED","STATUS","DOC TYPE","VERS","MEETING"]
["ARC-2017-0161","deviceCapability-attributes_RW-R3","C-DOT","2017-04-11T04:18:41","Draft","CR",null,"ARC 31"]
["ARC-2017-0162","deviceCapability-attributes_RW- MIRROR R2","C-DOT","2017-04-11T04:22:18","Draft","CR",null,"ARC 31"]
["ARC-2017-0296R02","TS-0026_Change_of_Chargeable_Party_Procedures","Convida","2017-07-14T13:13:31","Draft","CR",null,"ARC 31"]
["ARC-2017-0341","ScheduleResourceEditorialCleanup","Convida","2017-08-03T11:04:13","Noted","CR",null,"ARC 31"]
["ARC-2017-0344R01","Clarification_on_M2M-Service-Profile-Identifier","C-DOT","2017-08-09T08:36:53","Draft","CR",null,"ARC 31"]
["ARC-2017-0349","TS-0001-mgmtObj_firmware_software_R3","C-DOT","2017-08-16T12:33:59","Noted","CR",null,"ARC 31"]
["ARC-2017-0350","TS-0001-mgmtObj_firmware_software_MIRROR_R2","C-DOT","2017-08-16T12:35:33","Noted","CR",null,"ARC 31"]
["ARC-2017-0345R01","clause10.2.4.9 table update","Convida","2017-08-31T14:52:09","Agreed","CR",null,"ARC 31"]
["ARC-2017-0184R03","StorageBasedEventClarification_R3","Convida","2017-08-31T14:56:36","Draft","CR",null,"ARC 31"]
["ARC-2017-0355","CR_SubGroupMapping","C-DOT & Huawei","2017-09-04T08:39:47","Draft","CR",null,"ARC 31"]
["ARC-2017-0356","DiscoveryProcedures_Corrections","C-DOT","2017-09-04T08:42:08","Agreed","CR",null,"ARC 31"]
["ARC-2017-0357","ContentSizeTimeInstance","C-DOT","2017-09-06T04:39:22","Draft","CR",null,"ARC 31"]
["ARC-2017-0358","PrimitiveContentOfRequestResource","C-DOT","2017-09-06T04:42:26","Draft","CR",null,"ARC 31"]
["ARC-2017-0357R01","ContentSizeTimeSeriesInstance","C-DOT","2017-09-07T09:18:43","Draft","CR",null,"ARC 31"]
["ARC-2017-0359","ContentSizeTimeSeriesInstance-Mirror","C-DOT","2017-09-07T09:27:25","Draft","CR",null,"ARC 31"]
["ARC-2017-0360","PrimitiveContentOfRequestResource-Mirror","C-DOT","2017-09-07T09:28:48","Draft","CR",null,"ARC 31"]
["PRO-2017-0215R01","ContentSizeTimeSeriesInstance-Mirror","C-DOT","2017-09-07T09:55:53","Draft","CR",null,"ARC 31"]
["ARC-2017-0346R02","flexible_multicast_group_management_R3","ZTE","2017-09-08T08:25:27","Draft","CR",null,"ARC 31"]
["ARC-2017-0363","GroupTimeOutForAggregatingMessages","Convida","2017-09-09T15:06:52","Draft","CR",null,"ARC 31"]
["ARC-2017-0361","TS-0001 BDT correction","Convida","2017-09-09T18:46:46","Agreed","CR",null,"ARC 31"]
["ARC-2017-0362","TS-0001 clause 10.2.14 cleanup rel3","Convida, ZTE, NEC","2017-09-09T18:48:36","Noted","CR",null,"ARC 31"]
["ARC-2017-0365","accessControlObjectDetails","Convida","2017-09-09T19:32:48","Draft","CR",null,"ARC 31"]
["ARC-2017-0366","disableRetrievalDescription","Convida","2017-09-09T19:51:45","Draft","CR",null,"ARC 31"]
["ARC-2017-0367","Editorial Changes to crossResourceSubscription Resource","Convida","2017-09-10T01:33:42","Draft","INC",null,"ARC 31"]
["ARC-2017-0370","expirationTime of CSEBase (R2)","KETI","2017-09-10T07:47:44","Noted","CR",null,"ARC 31"]
["ARC-2017-0371","expirationTime of CSEBase (R3)","KETI","2017-09-10T07:47:58","Draft","CR",null,"ARC 31"]
["ARC-2017-0372","clarification on child resource reference of Result Content (R2)","KETI","2017-09-10T07:48:13","Noted","CR",null,"ARC 31"]
["ARC-2017-0373","clarification on child resource reference of Result Content (R3)","KETI","2017-09-10T07:48:26","Draft","CR",null,"ARC 31"]
["ARC-2017-0374","Request with flexBlocking Rel-3","KT","2017-09-10T11:25:15","Draft","CR",null,"ARC 31"]
["ARC-2017-0375","Request with flexBlocking Rel-2","KT","2017-09-10T11:27:25","Draft","CR",null,"ARC 31"]
["ARC-2017-0376","TS-0001_Release_Version_Handling","Convida","2017-09-10T12:30:14","Draft","CR",null,"ARC 31"]
["ARC-2017-0377","TS-0026_NIDD_Procedures","Convida","2017-09-10T12:37:19","Noted","CR",null,"ARC 31"]
["ARC-2017-0378","NIDD Discussion","Convida","2017-09-10T12:40:49","Noted","INC",null,"ARC 31"]
["ARC-2017-0379","TS-0001_Transaction_Management_Cleanup","Convida","2017-09-10T13:46:23","Draft","CR",null,"ARC 31"]
["ARC-2017-0380","TS-0001_NIDD_Support","Convida","2017-09-10T14:24:18","Draft","CR",null,"ARC 31"]
["ARC-2017-0381","filterConditionsDefinitions","Convida","2017-09-10T16:31:21","Draft","CR",null,"ARC 31"]
["ARC-2017-0382","GroupCreateFanoutPoint","Convida","2017-09-10T16:50:57","Draft","CR",null,"ARC 31"]
["ARC-2017-0383","New baseline for TS-0033 on Proximal IoT Interworking","Qualcomm Inc. (TIA)","2017-09-10T17:15:09","Noted","INC",null,"ARC 31"]
["ARC-2017-0384","disableRetrievalDescription-R2","Convida","2017-09-10T18:55:52","Draft","CR",null,"ARC 31"]
["ARC-2017-0385","filterConditionsDefinitions-R2","Convida","2017-09-10T19:54:37","Draft","CR",null,"ARC 31"]
["ARC-2017-0386","GroupCreateFanoutPoint-R2","Convida","2017-09-10T20:01:02","Draft","CR",null,"ARC 31"]
["ARC-2017-0364","Cleanup on Resource Types Table For Semantic Mashup Resources","Convida","2017-09-11T01:40:34","Agreed","CR",null,"ARC 31"]
["ARC-2017-0387","TS-0001-Multicast Group Enhancement for MBMS","Huawei Technologies Co., Ltd.","2017-09-11T01:49:06","Noted","CR",null,"ARC 31"]
["ARC-2017-0388","TS-0026-3GPP MBMS Solution","Huawei Technologies Co., Ltd.","2017-09-11T01:50:43","Noted","CR",null,"ARC 31"]
["ARC-2017-0389","TS-0001 clause6 security description update R3","Datang","2017-09-11T01:53:21","Draft","CR",null,"ARC 31"]
["ARC-2017-0390","TS-0001 clause6 security description update mirror R2","Datang","2017-09-11T01:55:20","Draft","CR",null,"ARC 31"]
["ARC-2017-0368","discussion on multimediaSession resource","KETI, ntels","2017-09-11T02:50:00","Draft","INC",null,"ARC 31"]
["ARC-2017-0391","modification of access mode for deviceInfo","NTT","2017-09-11T07:22:07","Noted","INC",null,"ARC 31"]
["ARC-2017-0392","TS-0001 deleting the virtual attribute R2 Mirror","BOE","2017-09-12T02:49:47","Draft","CR",null,"ARC 31"]
["ARC-2017-0393","TS-0001 deleting the virtual attribute R3","BOE","2017-09-12T02:51:31","Draft","CR",null,"ARC 31"]
["ARC-2017-0394","Clarification_on_registration(R3)","C-DOT","2017-09-12T05:26:38","Draft","CR",null,"ARC 31"]
["ARC-2017-0395","requestAggregationForPollingChannel-R3","Convida","2017-09-12T18:41:52","Draft","CR",null,"ARC 31"]
["ARC-2017-0388R01","TS-0026-3GPP MBMS Solution","Huawei Technologies Co., Ltd.","2017-09-14T12:35:55","Noted","CR",null,"ARC 31"]
["ARC-2017-0387R01","TS-0001-Multicast Group Enhancement for MBMS","Huawei Technologies Co., Ltd.","2017-09-14T12:36:37","Noted","CR",null,"ARC 31"]
["ARC-2017-0396","eventNotificationCriteria_childResourceType(R3)","C-DOT","2017-09-15T08:43:22","Draft","CR",null,"ARC 31"]
["ARC-2017-0357R02","ContentSizeTimeSeriesInstance","C-DOT","2017-09-15T09:07:36","Draft","CR",null,"ARC 31"]
["ARC-2017-0358R01","PrimitiveContentOfRequestResource","C-DOT","2017-09-15T09:08:22","Draft","CR",null,"ARC 31"]
["ARC-2017-0397","missing_assignedTokenIdentifier_response(R3)","C-DOT","2017-09-15T09:08:25","Draft","CR",null,"ARC 31"]
["ARC-2017-0359R01","ContentSizeTimeSeriesInstance-Mirror","C-DOT","2017-09-15T09:09:39","Draft","CR",null,"ARC 31"]
["ARC-2017-0360R01","PrimitiveContentOfRequestResource-Mirror","C-DOT","2017-09-15T09:10:24","Draft","CR",null,"ARC 31"]
["ARC-2017-0398","AERegistrationOnIN-CSE(R3).doc","C-DOT","2017-09-15T09:32:30","Draft","CR",null,"ARC 31"]
["ARC-2017-0399","AERegistrationOnIN-CSE(R2)","C-DOT","2017-09-15T10:49:31","Draft","CR",null,"ARC 31"]
["ARC-2017-0400","CR_SubGroupMapping(R2)","C-DOT & Huawei","2017-09-16T14:05:31","Draft","CR",null,"ARC 31"]
["ARC-2017-0401","Clarification_on_registration(R2)","C-DOT","2017-09-16T14:08:23","Draft","CR",null,"ARC 31"]
["ARC-2017-0402","DiscoveryProcedures_Corrections(R2)","C-DOT","2017-09-16T14:09:51","Noted","CR",null,"ARC 31"]
["ARC-2017-0404","ARC31_Document_Allocation","ARC VC","2017-09-17T06:34:34","Noted","INC",null,"ARC 31"]
["ARC-2017-0403","ARC_31_Meeting_Agenda","ARC VC","2017-09-17T06:50:44","Agreed","INC",null,"ARC 31"]
["ARC-2017-0377R01","TS-0026_NIDD_Procedures","Convida","2017-09-17T10:06:23","Draft","CR",null,"ARC 31"]
["ARC-2017-0404R01","ARC31_Document_Allocation","ARC VC","2017-09-18T04:47:15","Agreed","INC",null,"ARC 31"]
["ARC-2017-0359R02","ContentSizeTimeSeriesInstance-Mirror","C-DOT","2017-09-18T05:09:31","Draft","CR",null,"ARC 31"]
["ARC-2017-0341R01","ScheduleResourceEditorialCleanup","Convida","2017-09-18T05:27:24","Draft","CR",null,"ARC 31"]
["ARC-2017-0383R01","New baseline for TS-0033 on Proximal IoT Interworking","Qualcomm Inc. (TIA)","2017-09-18T05:31:37","Agreed","INC",null,"ARC 31"]
["ARC-2017-0405","StorageBasedEventClarification_R2","Convida","2017-09-18T05:33:10","Draft","CR",null,"ARC 31"]
["ARC-2017-0402R01","DiscoveryProcedures_Corrections(R2)","C-DOT","2017-09-18T10:03:54","Agreed","CR",null,"ARC 31"]
["ARC-2017-0362R01","TS-0001 clause 10.2.14 cleanup rel3","Convida, ZTE, NEC","2017-09-18T13:10:23","Draft","CR",null,"ARC 31"]
["ARC-2017-0376R01","TS-0001_Release_Version_Handling","Convida","2017-09-18T16:25:43","Noted","CR",null,"ARC 31"]
["ARC-2017-0390R01","TS-0001 clause6 security description update mirror R2","Datang","2017-09-19T02:17:48","Draft","CR",null,"ARC 31"]
["ARC-2017-0389R01","TS-0001 clause6 security description update R3","Datang","2017-09-19T02:18:21","Draft","CR",null,"ARC 31"]
["ARC-2017-0404R02","ARC31_Document_Allocation","ARC VC","2017-09-19T02:27:30","Draft","INC",null,"ARC 31"]
["ARC-2017-0389R02","TS-0001 clause6 security description update R3","Datang","2017-09-19T09:07:46","Draft","CR",null,"ARC 31"]
["ARC-2017-0390R02","TS-0001 clause6 security description update mirror R2","Datang","2017-09-19T09:08:16","Draft","CR",null,"ARC 31"]
["ARC-2017-0390R03","TS-0001 clause6 security description update mirror R2","Datang","2017-09-19T11:37:38","Draft","CR",null,"ARC 31"]
["ARC-2017-0376R02","TS-0001_Release_Version_Handling","Convida","2017-09-19T14:05:35","Draft","CR",null,"ARC 31"]
["ARC-2017-0406","TS-0001_Release_Version_Handling(R2)","Convida","2017-09-19T14:07:07","Draft","CR",null,"ARC 31"]
["ARC-2017-0407","short name for semanticValidation virtual resource TS-0001 R3","Yongjing Zhang (Huawei)","2017-09-19T16:16:53","Draft","CR",null,"ARC 31"]
["ARC-2017-0408","clause10.2.4.9 table update R2","Convida Wireless","2017-09-20T06:09:16","Draft","CR",null,"ARC 31"]
["ARC-2017-0409","short name for mashup resource","Convida","2017-09-20T06:22:36","Draft","CR",null,"ARC 31"]
["ARC-2017-0377R02","TS-0026_NIDD_Procedures","Convida","2017-09-20T18:52:00","Draft","CR",null,"ARC 31"]
["ARC-2017-0380R01","TS-0001_NIDD_Support","Convida","2017-09-20T18:52:46","Draft","CR",null,"ARC 31"]
["ARC-2017-0376R03","TS-0001_Release_Version_Handling","Convida","2017-09-20T20:28:27","Draft","CR",null,"ARC 31"]
["ARC-2017-0406R01","TS-0001_Release_Version_Handling(R2)","Convida","2017-09-20T20:28:53","Draft","CR",null,"ARC 31"]
["ARC-2017-0404R03","ARC31_Document_Allocation","ARC VC","2017-09-20T20:40:32","Draft","INC",null,"ARC 31"]
["PRO-2017-0215","ContentSizeTimeSeriesInstance-Mirror","C-DOT",null,"Draft","CR",null,"ARC 31"]
["ARC-2017-0369","CR on multimediaSession resource type and procedures","KETI, ntels",null,"Draft","CR",null,"ARC 31"]

{"sheet":"PRO","index":6,"n_rows":156,"n_cols":8,"rows_kept":156,"cut":false,"hidden":false,"merged":[]}
["SHORT DOC NB","SHORTNAME","SOURCE","UPLOADED","STATUS","DOC TYPE","VERS","MEETING"]
["PRO-2017-0155","Generic procedure for handling a Request at a receiver R3","KT","2017-07-02T04:26:54","Draft","CR",null,"PRO 31"]
["PRO-2017-0169","Fixed header of MQTT PUBLISH Packet","KT","2017-07-12T14:25:10","Draft","CR",null,"PRO 31"]
["PRO-2017-0185","CoAP Content-Format ID","QUALCOMM Inc. (TIA)","2017-08-01T04:47:57","Draft","CR",null,"PRO 31"]
["PRO-2017-0090R02","NewEventNotificationCriteria(R3)","C-DOT","2017-08-01T04:54:19","Agreed","CR",null,"PRO 31"]
["PRO-2017-0191","deviceInfo_attributes_R3","C-DOT","2017-08-08T12:06:41","Draft","CR",null,"PRO 31"]
["PRO-2017-0199","AERegistration_Request","C-DOT","2017-09-04T08:45:08","Noted","CR",null,"PRO 31"]
["PRO-2017-0200","CR_SubGroupMapping","C-DOT","2017-09-04T09:09:37","Draft","CR",null,"PRO 31"]
["PRO-2017-0201","mgmtObj_update","C-DOT","2017-09-05T09:37:07","Draft","CR",null,"PRO 31"]
["PRO-2017-0202","notificationForwardingURI_R3","C-DOT","2017-09-05T10:44:26","Draft","CR",null,"PRO 31"]
["PRO-2017-0203","discovery_warningInfo","C-DOT","2017-09-05T11:17:41","Noted","CR",null,"PRO 31"]
["PRO-2017-0206","mgmtObj_update_attributes_error","C-DOT","2017-09-06T04:38:04","Draft","CR",null,"PRO 31"]
["PRO-2017-0207","CheckSupportedResourceType","C-DOT","2017-09-06T05:35:48","Draft","CR",null,"PRO 31"]
["PRO-2017-0208","ContentSizeTimeInstance","C-DOT","2017-09-06T05:37:19","Draft","CR",null,"PRO 31"]
["PRO-2017-0209","GroupMemberValidation","C-DOT","2017-09-06T05:38:52","Draft","CR",null,"PRO 31"]
["PRO-2017-0210","MaxInstanceAgeCI","C-DOT","2017-09-06T05:40:37","Draft","CR",null,"PRO 31"]
["PRO-2017-0211","PrimitiveContentOfRequestResource","C-DOT","2017-09-06T05:44:49","Draft","CR",null,"PRO 31"]
["PRO-2017-0212","SequenceNrTimeSeriesInstance","C-DOT","2017-09-06T05:46:16","Draft","CR",null,"PRO 31"]
["PRO-2017-0213","TimeSeriesInstanceCreate","C-DOT","2017-09-06T05:47:54","Draft","CR",null,"PRO 31"]
["PRO-2017-0209R01","GroupMemberValidation","C-DOT","2017-09-07T09:04:01","Draft","CR",null,"PRO 31"]
["PRO-2017-0208R01","ContentSizeTimeSeriesInstance","C-DOT","2017-09-07T09:17:22","Draft","CR",null,"PRO 31"]
["PRO-2017-0214","CheckSupportedResourceType-Mirror","C-DOT","2017-09-07T09:31:18","Draft","CR",null,"PRO 31"]
["PRO-2017-0216","GroupMemberValidation-Mirror","C-DOT","2017-09-07T09:57:16","Draft","CR",null,"PRO 31"]
["PRO-2017-0217","MaxInstanceAgeCI-Mirror","C-DOT","2017-09-07T09:58:32","Draft","CR",null,"PRO 31"]
["PRO-2017-0218","PrimitiveContentOfRequestResource-Mirror","C-DOT","2017-09-07T10:01:30","Draft","CR",null,"PRO 31"]
["PRO-2017-0219","SequenceNrTimeSeriesInstance-Mirror","C-DOT","2017-09-07T10:05:58","Draft","CR",null,"PRO 31"]
["PRO-2017-0220","TimeSeriesInstanceCreate-Mirror","C-DOT","2017-09-07T10:10:21","Draft","CR",null,"PRO 31"]
["PRO-2017-0226","action_shortName(R3)","C-DOT","2017-09-08T06:49:41","Draft","CR",null,"PRO 31"]
["PRO-2017-0227","mgmtCmd_update(normal)_R3","C-DOT","2017-09-08T06:50:25","Draft","CR",null,"PRO 31"]
["PRO-2017-0228","Resource_de-announcement_correction_R2","ZTE","2017-09-08T08:18:48","Draft","CR",null,"PRO 31"]
["PRO-2017-0229","Resource_de-announcement_correction_R3","ZTE","2017-09-08T08:22:09","Draft","CR",null,"PRO 31"]
["PRO-2017-0225","update to semanticDescriptor resource & procedure TS-0004 R3","Yongjing Zhang (Huawei)","2017-09-08T10:30:04","Noted","CR",null,"PRO 31"]
["PRO-2017-0224","semanticValidation resource & procedures TS-0004 R3","Yongjing Zhang (Huawei)","2017-09-08T10:30:19","Noted","CR",null,"PRO 31"]
["PRO-2017-0223","ontology resource & procedures TS-0004 R3","Yongjing Zhang (Huawei)","2017-09-08T10:30:31","Noted","CR",null,"PRO 31"]
["PRO-2017-0222","ontologyRepository resource & procedures TS-0004 R3","Yongjing Zhang (Huawei)","2017-09-08T10:30:43","Noted","CR",null,"PRO 31"]
["PRO-2017-0232","RemoveGroupOfGroups","Convida","2017-09-09T15:39:28","Noted","CR",null,"PRO 31"]
["PRO-2017-0236","MQTTListeningTopicType","Convida","2017-09-09T18:14:41","Draft","CR",null,"PRO 31"]
["PRO-2017-0236R01","MQTTListeningTopicType","Convida","2017-09-09T18:18:49","Noted","CR",null,"PRO 31"]
["PRO-2017-0231","TS-0004 BDT","Convida","2017-09-09T18:49:09","Draft","CR",null,"PRO 31"]
["PRO-2017-0237","MQTTRegistration","Convida","2017-09-09T18:49:10","Draft","CR",null,"PRO 31"]
["PRO-2017-0230","TS-0004 TP schedule node","Convida","2017-09-09T18:49:32","Draft","CR",null,"PRO 31"]
["PRO-2017-0238","disableRetrievalPresence","Convida","2017-09-10T00:18:57","Agreed","CR",null,"PRO 31"]
["PRO-2017-0239","Cross Resource Subscription General Changes","Convida","2017-09-10T01:36:29","Noted","INC",null,"PRO 31"]
["PRO-2017-0240","Cross Resource Subscription Resource Description and Operations","Convida","2017-09-10T01:37:56","Noted","INC",null,"PRO 31"]
["PRO-2017-0241","Cross Resource Subscription Notification Procedure","Convida","2017-09-10T01:39:29","Noted","INC",null,"PRO 31"]
["PRO-2017-0242","timeSeries resource Rel-3","KT","2017-09-10T11:33:01","Noted","CR",null,"PRO 31"]
["PRO-2017-0243","Informational status-code mapping to CoAP Rel-2","KT","2017-09-10T11:35:49","Noted","CR",null,"PRO 31"]
["PRO-2017-0244","Informational status-code mapping to HTTP Rel-2","KT","2017-09-10T11:38:03","Agreed","CR",null,"PRO 31"]
["PRO-2017-0245","example of JSON serialization in TS-0004 Rel-3","KT","2017-09-10T11:40:17","Noted","CR",null,"PRO 31"]
["PRO-2017-0246","TS-0004-AE_Initiated_Triggering_R3","Convida","2017-09-10T13:18:49","Draft","CR",null,"PRO 31"]
["PRO-2017-0247","TS-0004_Transaction_Management_R3","Convida","2017-09-10T13:31:14","Draft","CR",null,"PRO 31"]
["PRO-2017-0248","RemoveGroupOfGroups-R2","Convida","2017-09-10T18:38:25","Noted","CR",null,"PRO 31"]
["PRO-2017-0249","DisableRetrievalPresence-R2","Convida","2017-09-10T18:45:14","Agreed","CR",null,"PRO 31"]
["PRO-2017-0250","locationPolicy Enhancement-R2","Huawei Technologies Co., Ltd.","2017-09-11T01:25:56","Draft","CR",null,"PRO 31"]
["PRO-2017-0251","locationPolicy_Enhancement-R3","Huawei Technologies Co., Ltd.","2017-09-11T01:27:27","Draft","CR",null,"PRO 31"]
["PRO-2017-0252","Node Management","Huawei Technologies Co., Ltd.","2017-09-11T01:28:47","Draft","CR",null,"PRO 31"]
["PRO-2017-0235","Semantic Mashup in TS-0004","Convida","2017-09-11T01:38:16","Noted","CR",null,"PRO 31"]
["PRO-2017-0234","Semantic Content Support in TS-0004","Convida, NEC","2017-09-11T01:38:38","Noted","CR",null,"PRO 31"]
["PRO-2017-0233","Semantic Query Support in TS-0004","Convida, NEC","2017-09-11T01:38:53","Noted","CR",null,"PRO 31"]
["PRO-2017-0253","update_table_about_token","NTT","2017-09-11T07:12:28","Noted","CR",null,"PRO 31"]
["PRO-2017-0254","update_table_about_token_MIRROR_R3","NTT","2017-09-11T07:14:47","Noted","CR",null,"PRO 31"]
["PRO-2017-0255","absRelTimestamp_mismatch","NTT","2017-09-11T08:32:59","Noted","INC",null,"PRO 31"]
["PRO-2017-0199R01","AERegistration_Request","C-DOT","2017-09-11T10:00:42","Agreed","CR",null,"PRO 31"]
["PRO-2017-0256","Service_Layer_Forwarding_R3","Convida","2017-09-11T14:57:37","Draft","CR",null,"PRO 31"]
["PRO-2017-0257","TS-0009_content_location(R2)","C-DOT","2017-09-12T05:27:50","Noted","CR",null,"PRO 31"]
["PRO-2017-0258","AERegistration_Request(R2)","C-DOT","2017-09-12T06:58:18","Agreed","CR",null,"PRO 31"]
["PRO-2017-0259","FanoutpointValidation(R3)","C-DOT","2017-09-12T07:00:02","Draft","CR",null,"PRO 31"]
["PRO-2017-0260","FanoutpointValidation(R2)","C-DOT","2017-09-12T07:01:18","Draft","CR",null,"PRO 31"]
["PRO-2017-0261","RequestAggregationForPollingChannel_R3","Convida","2017-09-12T20:13:05","Draft","CR",null,"PRO 31"]
["PRO-2017-0256R01","Service_Layer_Forwarding_R3","Convida","2017-09-12T20:16:52","Noted","CR",null,"PRO 31"]
["PRO-2017-0261R01","RequestAggregationForPollingChannel_R3","Convida","2017-09-12T20:26:27","Draft","CR",null,"PRO 31"]
["PRO-2017-0262","Required IANA registrations for oneM2M PRO specs","Qualcomm Inc. (TIA)","2017-09-14T07:26:35","Noted","INC",null,"PRO 31"]
["PRO-2017-0263","mgmtObj_update_MIRROR_R2","C-DOT","2017-09-14T08:39:23","Draft","CR",null,"PRO 31"]
["PRO-2017-0264","mgmtObj_update_attributes_error_MIRROR_R2","C-DOT","2017-09-14T08:41:42","Draft","CR",null,"PRO 31"]
["PRO-2017-0265","mgmtObj_correction","C-DOT","2017-09-14T08:44:01","Draft","CR",null,"PRO 31"]
["PRO-2017-0266","mgmtObj_correction_MIRROR_R2","C-DOT","2017-09-14T08:45:44","Draft","CR",null,"PRO 31"]
["PRO-2017-0267","mgmtObj_firmware_procedures_R3","C-DOT","2017-09-14T08:46:32","Draft","CR",null,"PRO 31"]
["PRO-2017-0268","mgmtObj_firmware_procedures_MIRROR_R2","C-DOT","2017-09-14T08:47:41","Draft","CR",null,"PRO 31"]
["PRO-2017-0207R01","CheckSupportedResourceType","C-DOT","2017-09-15T08:56:17","Draft","CR",null,"PRO 31"]
["PRO-2017-0208R02","ContentSizeTimeSeriesInstance","C-DOT","2017-09-15T08:57:50","Draft","CR",null,"PRO 31"]
["PRO-2017-0210R01","MaxInstanceAgeCI","C-DOT","2017-09-15T08:58:38","Draft","CR",null,"PRO 31"]
["PRO-2017-0211R01","PrimitiveContentOfRequestResource","C-DOT","2017-09-15T08:59:43","Agreed","CR",null,"PRO 31"]
["PRO-2017-0213R01","TimeSeriesInstanceCreate","C-DOT","2017-09-15T09:00:30","Draft","CR",null,"PRO 31"]
["PRO-2017-0214R01","CheckSupportedResourceType-Mirror","C-DOT","2017-09-15T09:01:05","Draft","CR",null,"PRO 31"]
["PRO-2017-0215R02","ContentSizeTimeSeriesInstance-Mirror","C-DOT","2017-09-15T09:02:18","Draft","CR",null,"PRO 31"]
["PRO-2017-0217R01","MaxInstanceAgeCI-Mirror","C-DOT","2017-09-15T09:03:08","Draft","CR",null,"PRO 31"]
["PRO-2017-0218R01","PrimitiveContentOfRequestResource-Mirror","C-DOT","2017-09-15T09:04:34","Noted","CR",null,"PRO 31"]
["PRO-2017-0220R01","TimeSeriesInstanceCreate-Mirror","C-DOT","2017-09-15T09:05:14","Draft","CR",null,"PRO 31"]
["PRO-2017-0269","authorSignReqInfo_correction(R3)","C-DOT","2017-09-15T09:12:39","Draft","CR",null,"PRO 31"]
["PRO-2017-0271","action_shortName(R2)","C-DOT","2017-09-16T13:16:31","Draft","CR",null,"PRO 31"]
["PRO-2017-0272","CR_SubGroupMapping(R2)","C-DOT","2017-09-16T13:20:45","Draft","CR",null,"PRO 31"]
["PRO-2017-0273","discovery_warningInfo(R2)","C-DOT","2017-09-16T13:22:50","Draft","CR",null,"PRO 31"]
["PRO-2017-0274","mgmtCmd_update(normal)_R2","C-DOT","2017-09-16T13:26:23","Draft","CR",null,"PRO 31"]
["PRO-2017-0210R02","MaxInstanceAgeCI","C-DOT","2017-09-16T14:15:20","Noted","CR",null,"PRO 31"]
["PRO-2017-0209R02","GroupMemberValidation","C-DOT","2017-09-16T14:23:18","Agreed","CR",null,"PRO 31"]
["PRO-2017-0213R02","TimeSeriesInstanceCreate","C-DOT","2017-09-16T14:24:41","Draft","CR",null,"PRO 31"]
["PRO-2017-0216R01","GroupMemberValidation-Mirror","C-DOT","2017-09-16T14:26:20","Agreed","CR",null,"PRO 31"]
["PRO-2017-0217R02","MaxInstanceAgeCI-Mirror","C-DOT","2017-09-16T14:26:58","Noted","CR",null,"PRO 31"]
["PRO-2017-0220R02","TimeSeriesInstanceCreate-Mirror","C-DOT","2017-09-16T14:27:50","Draft","CR",null,"PRO 31"]
["PRO-2017-0270","Agenda PRO31","PRO WG Chair","2017-09-17T14:20:59","Noted","AG",null,"PRO 31"]
["PRO-2017-0213R03","TimeSeriesInstanceCreate","C-DOT","2017-09-18T08:17:21","Draft","CR",null,"PRO 31"]
["PRO-2017-0220R03","TimeSeriesInstanceCreate-Mirror","C-DOT","2017-09-18T08:23:06","Draft","CR",null,"PRO 31"]
["PRO-2017-0200R01","CR_SubGroupMapping","C-DOT","2017-09-18T08:52:20","Draft","CR",null,"PRO 31"]
["PRO-2017-0245R01","example of JSON serialization in TS-0004 Rel-3","KT","2017-09-18T10:16:31","Agreed","CR",null,"PRO 31"]
["PRO-2017-0242R01","timeSeries resource Rel-3","KT","2017-09-18T10:32:27","Draft","CR",null,"PRO 31"]
["PRO-2017-0275","timeSeries resource Rel-2","KT","2017-09-18T23:15:38","Draft","CR",null,"PRO 31"]
["PRO-2017-0243R01","Informational status-code mapping to CoAP Rel-2","KT","2017-09-19T00:29:33","Draft","CR",null,"PRO 31"]
["PRO-2017-0222R01","ontologyRepository resource & procedures TS-0004 R3","Yongjing Zhang (Huawei)","2017-09-19T06:08:32","Noted","CR",null,"PRO 31"]
["PRO-2017-0222R02","ontologyRepository resource & procedures TS-0004 R3","Yongjing Zhang (Huawei)","2017-09-19T16:18:09","Agreed","CR",null,"PRO 31"]
["PRO-2017-0223R01","ontology resource & procedures TS-0004 R3","Yongjing Zhang (Huawei)","2017-09-19T16:18:50","Noted","CR",null,"PRO 31"]
["PRO-2017-0224R01","semanticValidation resource & procedures TS-0004 R3","Yongjing Zhang (Huawei)","2017-09-19T16:19:18","Agreed","CR",null,"PRO 31"]
["PRO-2017-0225R01","update to semanticDescriptor resource & procedure TS-0004 R3","Yongjing Zhang (Huawei)","2017-09-19T16:19:43","Noted","CR",null,"PRO 31"]
["PRO-2017-0242R02","timeSeries resource Rel-3","KT","2017-09-19T23:33:26","Noted","CR",null,"PRO 31"]
["PRO-2017-0276","execInstance resource Rel-3","KT","2017-09-20T00:24:19","Draft","CR",null,"PRO 31"]
["PRO-2017-0277","m2mServiceSubscriptionProfile resource Rel-3","KT","2017-09-20T00:50:08","Draft","CR",null,"PRO 31"]
["PRO-2017-0278","semanticDescriptor resource Rel-3","KT","2017-09-20T01:12:38","Draft","CR",null,"PRO 31"]
["PRO-2017-0279","notificationTargetMgmtPolicyRef resource Rel-3","KT","2017-09-20T03:34:39","Draft","CR",null,"PRO 31"]
["PRO-2017-0280","policyDeletionRules resource Rel-3","KT","2017-09-20T03:53:58","Draft","CR",null,"PRO 31"]
["PRO-2017-0185R01","CoAP Content-Format ID","QUALCOMM Inc. (TIA)","2017-09-20T05:45:27","Agreed","CR",null,"PRO 31"]
["PRO-2017-0281","execInstance resource Rel-2","KT","2017-09-20T07:17:33","Draft","CR",null,"PRO 31"]
["PRO-2017-0282","serviceSubscribedNode resource Rel-2","KT","2017-09-20T07:19:22","Draft","CR",null,"PRO 31"]
["PRO-2017-0283","notificationTargetMgmtPolicyRef resource Rel-2","KT","2017-09-20T07:22:02","Draft","CR",null,"PRO 31"]
["PRO-2017-0284","notificationTargetPolicy resource Rel-2","KT","2017-09-20T07:24:12","Draft","CR",null,"PRO 31"]
["PRO-2017-0285","policyDeletionRules resource Rel-2","KT","2017-09-20T07:26:01","Draft","CR",null,"PRO 31"]
["PRO-2017-0286","semanticDescriptor resource Rel-2","KT","2017-09-20T07:27:32","Draft","CR",null,"PRO 31"]
["PRO-2017-0233R01","Semantic Query Support in TS-0004","Convida, NEC","2017-09-20T11:44:35","Agreed","CR",null,"PRO 31"]
["PRO-2017-0235R01","Semantic Mashup in TS-0004","Convida","2017-09-20T11:45:28","Noted","CR",null,"PRO 31"]
["PRO-2017-0250R01","locationPolicy Enhancement-R2","Huawei Technologies Co., Ltd.","2017-09-20T16:07:13","Draft","CR",null,"PRO 31"]
["PRO-2017-0251R01","locationPolicy_Enhancement-R3","Huawei Technologies Co., Ltd.","2017-09-20T16:08:26","Draft","CR",null,"PRO 31"]
["PRO-2017-0270R01","Agenda PRO31","PRO WG Chair","2017-09-20T19:00:17","Draft","AG",null,"PRO 31"]
["PRO-2017-0203R01","discovery_warningInfo","C-DOT","2017-09-21T03:21:56","Draft","CR",null,"PRO 31"]
["PRO-2017-0202R01","notificationForwardingURI_R3","C-DOT","2017-09-21T03:22:43","Draft","CR",null,"PRO 31"]
["PRO-2017-0250R02","locationPolicy Enhancement-R2","Huawei Technologies Co., Ltd.","2017-09-21T03:58:05","Noted","CR",null,"PRO 31"]
["PRO-2017-0251R02","locationPolicy_Enhancement-R3","Huawei Technologies Co., Ltd.","2017-09-21T03:59:42","Agreed","CR",null,"PRO 31"]
["PRO-2017-0252R01","Node Management","Huawei Technologies Co., Ltd.","2017-09-21T04:00:28","Draft","CR",null,"PRO 31"]
["PRO-2017-0239R01","Cross Resource Subscription General Changes","Convida","2017-09-21T05:34:58","Draft","INC",null,"PRO 31"]
["PRO-2017-0200R02","CR_SubGroupMapping","C-DOT","2017-09-21T10:00:57","Agreed","CR",null,"PRO 31"]
["PRO-2017-0256R02","Service_Layer_Forwarding_R3","Convida","2017-09-21T10:19:28","Draft","CR",null,"PRO 31"]
["PRO-2017-0253R01","update_table_about_token","NTT","2017-09-21T10:35:37","Agreed","CR",null,"PRO 31"]
["PRO-2017-0254R01","update_table_about_token_MIRROR_R3","NTT","2017-09-21T10:36:20","Agreed","CR",null,"PRO 31"]
["PRO-2017-0250R03","locationPolicy Enhancement-R2","Huawei Technologies Co., Ltd.","2017-09-21T10:41:27","Agreed","CR",null,"PRO 31"]
["PRO-2017-0242R03","timeSeries resource Rel-3","KT","2017-09-21T10:44:29","Draft","CR",null,"PRO 31"]
["PRO-2017-0272R01","CR_SubGroupMapping(R2)","C-DOT","2017-09-21T10:49:04","Draft","CR",null,"PRO 31"]
["PRO-2017-0257R01","TS-0009_content_location(R2)","C-DOT","2017-09-21T10:51:12","Agreed","CR",null,"PRO 31"]
["PRO-2017-0287","example of JSON serialization in TS-0004 Rel-2 Mirror","KT","2017-09-21T10:53:33","Draft","CR",null,"PRO 31"]
["PRO-2017-0202R02","notificationForwardingURI_R3","C-DOT","2017-09-21T11:04:15","Noted","CR",null,"PRO 31"]
["PRO-2017-0218R02","PrimitiveContentOfRequestResource-Mirror","C-DOT","2017-09-21T11:07:07","Agreed","CR",null,"PRO 31"]
["PRO-2017-0210R03","MaxInstanceAgeCI","C-DOT","2017-09-21T11:09:47","Agreed","CR",null,"PRO 31"]
["PRO-2017-0217R03","MaxInstanceAgeCI-Mirror","C-DOT","2017-09-21T11:12:49","Agreed","CR",null,"PRO 31"]
["PRO-2017-0288","PRO-2017-0288-m2m_status_mgmtObj_R3","C-DOT","2017-09-21T11:53:37","Draft","CR",null,"PRO 31"]
["PRO-2017-0289","PRO-2017-0289-m2m_status_mgmtObj_MIRROR_R2","C-DOT","2017-09-21T11:57:31","Draft","CR",null,"PRO 31"]
["PRO-2017-0227R01","mgmtCmd_update(normal)_R3","C-DOT","2017-09-21T12:07:20","Agreed","CR",null,"PRO 31"]
["PRO-2017-0225R02","update to semanticDescriptor resource & procedure TS-0004 R3","Yongjing Zhang (Huawei)","2017-09-21T12:09:11","Agreed","CR",null,"PRO 31"]
["PRO-2017-0223R02","ontology resource & procedures TS-0004 R3","Yongjing Zhang (Huawei)","2017-09-21T12:12:47","Agreed","CR",null,"PRO 31"]
["PRO-2017-0243R02","Informational status-code mapping to CoAP Rel-2","KT","2017-09-21T12:17:31","Draft","CR",null,"PRO 31"]
["PRO-2017-0274R01","mgmtCmd_update(normal)_R2","C-DOT","2017-09-21T12:23:27","Draft","CR",null,"PRO 31"]

{"sheet":"SEC","index":7,"n_rows":17,"n_cols":8,"rows_kept":17,"cut":false,"hidden":false,"merged":[]}
["SHORT DOC NB","SHORTNAME","SOURCE","UPLOADED","STATUS","DOC TYPE","VERS","MEETING"]
["SEC-2017-0128","New TR Baseline for WI 0073 App-ID Registry Function","Ian Deakin, iconectiv","2017-09-08T01:35:17","Draft","CR",null,"SEC 31"]
["SEC-2017-0129","Revision of PPM for Rel3","KDDI","2017-09-11T12:41:34","Draft","CR",null,"SEC 31"]
["SEC-2017-0130","App-ID Registry Function TR intro","iconectiv","2017-09-13T15:34:41","Draft","INC",null,"SEC 31"]
["SEC-2017-0131","App-ID Registry Function TR use case 1","iconectiv","2017-09-13T15:36:04","Draft","AG",null,"SEC 31"]
["SEC-2017-0132","App-ID Registry Function TR use case 2","iconectiv","2017-09-13T15:36:40","Draft","INC",null,"SEC 31"]
["SEC-2017-0133","App-ID Registry Function TR use case 1","iconecitv","2017-09-13T15:38:36","Withdrawn","INC",null,"SEC 31"]
["SEC-2017-0134","App-ID Registry Function TR use case 3","iconectiv","2017-09-13T15:39:18","Draft","INC",null,"SEC 31"]
["SEC-2017-0135","App-ID Registry Function TR use case 4","iconectiv","2017-09-13T15:40:27","Draft","INC",null,"SEC 31"]
["SEC-2017-0136","App-ID Registry Function TR use case 5","iconectiv","2017-09-13T15:57:24","Draft","INC",null,"SEC 31"]
["SEC-2017-0137","SEC 31 F2F meeting Agenda","WG Chair (Gemalto)","2017-09-15T08:24:44","Noted","AG",null,"SEC 31"]
["SEC-2017-0138","CR TR-0038 Security Developers Guide Cleanup","Gemalto","2017-09-15T12:52:57","Draft","CR",null,"SEC 31"]
["SEC-2017-0137R01","SEC 31 F2F meeting Agenda","WG Chair (Gemalto)","2017-09-15T16:43:49","Draft","AG",null,"SEC 31"]
["SEC-2017-0139","TS-0016_CR_SE-Resource","G+D","2017-09-15T17:42:43","Draft","CR",null,"SEC 31"]
["SEC-2017-0140","CR TS-0003 new ECC","Orange","2017-09-17T13:06:49","Draft","CR",null,"SEC 31"]
["SEC-2017-0141","TS003 editorial changes","Orange","2017-09-17T17:11:04","Draft","CR",null,"SEC 31"]
["SEC-2017-0142","Annex L enhancement","Orange","2017-09-17T19:53:38","Draft","CR",null,"SEC 31"]

{"sheet":"MAS","index":8,"n_rows":37,"n_cols":8,"rows_kept":37,"cut":false,"hidden":false,"merged":[]}
["SHORT DOC NB","SHORTNAME","SOURCE","UPLOADED","STATUS","DOC TYPE","VERS","MEETING"]
["MAS-2017-0212R01","HAIM_modification_for_cookerFood_model","Qualcomm Inc. (TIA)","2017-08-29T04:19:44","Draft","CR",null,"MAS 31"]
["MAS-2017-0199R01","rewriting TS-0030-Generic-Interworking","NEC","2017-09-08T18:48:17","Noted","INC",null,"MAS 31"]
["MAS-2017-0200R01","changes to TS-0012 due to rewriting TS-0030-Generic-Interworking","NEC","2017-09-08T19:02:29","Noted","INC",null,"MAS 31"]
["MAS-2017-0221","semanticMashupInstance Resource Clarification","Convida","2017-09-11T01:37:46","Agreed","CR",null,"MAS 31"]
["MAS-2017-0222","New WI on Industrial Domain Information Model","Hitachi","2017-09-11T01:48:20","Noted","INC",null,"MAS 31"]
["MAS-2017-0222R01","New WI on Industrial Domain Information Model","Hitachi","2017-09-11T03:06:28","Noted","INC",null,"MAS 31"]
["MAS-2017-0223","Adding support managing gallery device","BOE","2017-09-11T06:14:56","Noted","CR",null,"MAS 31"]
["MAS-2017-0224","MAS#31 Agenda","Yongjing Zhang (Huawei, MAS Chair)","2017-09-12T13:12:50","Noted","AG",null,"MAS 31"]
["MAS-2017-0225","MAS#31 Doc Allocation","Yongjing Zhang (Huawei, MAS Chair)","2017-09-12T13:13:03","Noted","AG",null,"MAS 31"]
["MAS-2017-0199R02","rewriting TS-0030-Generic-Interworking","NEC","2017-09-13T17:31:18","Noted","INC",null,"MAS 31"]
["MAS-2017-0226","Added semantic check aspects in semantic validation","KT","2017-09-13T20:46:14","Noted","CR",null,"MAS 31"]
["MAS-2017-0227","TS-0006-mgmtCmd_execResult(R3)","C-DOT","2017-09-14T11:43:08","Draft","CR",null,"MAS 31"]
["MAS-2017-0228","TS-0006-mgmtCmd_execResult(R2)","C-DOT","2017-09-14T11:44:57","Draft","CR",null,"MAS 31"]
["MAS-2017-0225R01","MAS#31 Doc Allocation","Yongjing Zhang (Huawei, MAS Chair)","2017-09-15T07:40:10","Noted","AG",null,"MAS 31"]
["MAS-2017-0231","HAIM_Mapping_OMA_DWAPI_3DP_data_type","ETRI, HERIT","2017-09-17T12:21:56","Noted","CR",null,"MAS 31"]
["MAS-2017-0230","HAIM_Mapping_OMA_DWAPI_3DP_dev_model","ETRI, HERIT","2017-09-17T12:22:14","Noted","CR",null,"MAS 31"]
["MAS-2017-0229","HAIM_Mapping_OMA_DWAPI_introduction","ETRI, HERIT","2017-09-17T12:22:28","Noted","CR",null,"MAS 31"]
["MAS-2017-0222R02","New WI on Industrial Domain Information Model","Hitachi","2017-09-18T05:26:26","Noted","INC",null,"MAS 31"]
["MAS-2017-0226R01","Added semantic check aspects in semantic validation","KT","2017-09-18T08:06:27","Noted","CR",null,"MAS 31"]
["MAS-2017-0224R01","MAS#31 Agenda","Yongjing Zhang (Huawei, MAS Chair)","2017-09-18T09:39:25","Agreed","AG",null,"MAS 31"]
["MAS-2017-0225R02","MAS#31 Doc Allocation","Yongjing Zhang (Huawei, MAS Chair)","2017-09-18T09:40:43","Noted","AG",null,"MAS 31"]
["MAS-2017-0225R03","MAS#31 Doc Allocation","Yongjing Zhang (Huawei, MAS Chair)","2017-09-18T16:02:56","Noted","AG",null,"MAS 31"]
["MAS-2017-0230R01","HAIM_Mapping_OMA_DWAPI_3DP_dev_model","ETRI, HERIT","2017-09-19T05:15:17","Noted","CR",null,"MAS 31"]
["MAS-2017-0200R02","changes to TS-0012 due to rewriting TS-0030-Generic-Interworking","NEC","2017-09-19T05:53:00","Noted","INC",null,"MAS 31"]
["MAS-2017-0200R03","changes to TS-0012 due to rewriting TS-0030-Generic-Interworking","NEC","2017-09-19T07:45:50","Agreed","INC",null,"MAS 31"]
["MAS-2017-0199R03","rewriting TS-0030-Generic-Interworking","NEC","2017-09-19T10:32:04","Noted","INC",null,"MAS 31"]
["MAS-2017-0226R02","Added semantic check aspects in semantic validation","KT","2017-09-19T11:07:34","Noted","CR",null,"MAS 31"]
["MAS-2017-0225R04","MAS#31 Doc Allocation","Yongjing Zhang (Huawei, MAS Chair)","2017-09-19T17:01:40","Draft","AG",null,"MAS 31"]
["MAS-2017-0232","WI-0063 update and rename to Ontology based Interworking","NEC","2017-09-20T05:02:32","Noted","INC",null,"MAS 31"]
["MAS-2017-0229R01","HAIM_Mapping_OMA_DWAPI_introduction","ETRI, HERIT","2017-09-21T04:23:06","Noted","CR",null,"MAS 31"]
["MAS-2017-0231R01","HAIM_Mapping_OMA_DWAPI_3DP_data_type","ETRI, HERIT","2017-09-21T05:30:07","Agreed","CR",null,"MAS 31"]
["MAS-2017-0230R02","HAIM_Mapping_OMA_DWAPI_3DP_dev_model","ETRI, HERIT","2017-09-21T05:30:29","Agreed","CR",null,"MAS 31"]
["MAS-2017-0229R02","HAIM_Mapping_OMA_DWAPI_introduction","ETRI, HERIT","2017-09-21T06:03:12","Noted","CR",null,"MAS 31"]
["MAS-2017-0199R04","rewriting TS-0030-Generic-Interworking","NEC","2017-09-21T06:08:39","Agreed","INC",null,"MAS 31"]
["MAS-2017-0229R03","HAIM_Mapping_OMA_DWAPI_introduction","ETRI, HERIT","2017-09-21T06:16:18","Agreed","CR",null,"MAS 31"]
["MAS-2017-0226R03","Added semantic check aspects in semantic validation","KT","2017-09-21T06:31:38","Draft","CR",null,"MAS 31"]

{"sheet":"TST","index":9,"n_rows":28,"n_cols":8,"rows_kept":28,"cut":false,"hidden":false,"merged":[]}
["SHORT DOC NB","SHORTNAME","SOURCE","UPLOADED","STATUS","DOC TYPE","VERS","MEETING"]
["TST-2017-0221R01","Test specs release management","Miguel Angel Reina Ortega, ETSI","2017-08-30T15:02:32","Noted","INC",null,"TST 31"]
["TST-2017-0227","Developer_Guide_of_3GPP_Interworking_Skeleton","Huawei Technologies Co., Ltd.","2017-09-11T01:54:01","Agreed","INC",null,"TST 31"]
["TST-2017-0228","semanticInterop-R2","Convida","2017-09-11T20:17:51","Draft","CR",null,"TST 31"]
["TST-2017-0229","TS-0017_new_baseline_v_0_1_0","KETI","2017-09-13T02:49:02","Agreed","INC",null,"TST 31"]
["TST-2017-0230","TS-0018_new_baseline_v_0_5_0","KETI","2017-09-13T02:51:17","Agreed","INC",null,"TST 31"]
["TST-2017-0231","TS-0018_Changes_from_STF531","Miguel Angel Reina Ortega, ETSI","2017-09-13T07:08:15","Agreed","CR",null,"TST 31"]
["TST-2017-0232","Final corrections of SDT-IPE DvprGuide","Maciej Goluch (Orange)","2017-09-13T09:56:14","Noted","CR",null,"TST 31"]
["TST-2017-0233","TR-0045 Baseline after editHelp","NEC","2017-09-13T13:46:01","Agreed","INC",null,"TST 31"]
["TST-2017-0234","Added_missing_descriptorRepresentation_attribute_in_TR-0045","NEC","2017-09-13T14:28:03","Noted","CR",null,"TST 31"]
["TST-2017-0235","New_baseline_of_TR-0034_after_editHelp","Shane HE, Nokia","2017-09-14T13:07:37","Agreed","INC",null,"TST 31"]
["TST-2017-0236","TS-0019-ATS-Baseline-V0_4_0","Miguel Angel Reina Ortega, ETSI","2017-09-15T10:02:45","Agreed","INC",null,"TST 31"]
["TST-2017-0237","CR-TS-0013 update test descriptions for flexContainer","TTA (Heejin Joung)","2017-09-16T13:32:52","Agreed","CR",null,"TST 31"]
["TST-2017-0238","TST 31 Agenda","TST Chair (KETI)","2017-09-17T04:16:27","Noted","AG",null,"TST 31"]
["TST-2017-0239","TST 31 docs allocation","TST Chair (KETI)","2017-09-17T05:06:52","Noted","AG",null,"TST 31"]
["TST-2017-0238R01","TST 31 Agenda","TST Chair (KETI)","2017-09-17T05:07:21","Agreed","AG",null,"TST 31"]
["TST-2017-0232R01","Final corrections of SDT-IPE DvprGuide","Maciej Goluch (Orange)","2017-09-18T12:28:14","Agreed","CR",null,"TST 31"]
["TST-2017-0240","semantic_testing_proposal","Easy Global Market","2017-09-19T09:41:44","Draft","INC",null,"TST 31"]
["TST-2017-0234R01","Added_missing_descriptorRepresentation_attribute_in_TR-0045","NEC","2017-09-19T13:35:51","Noted","CR",null,"TST 31"]
["TST-2017-0242","allow_TTCN-3_tool_extensions","Easy Global Market","2017-09-19T23:25:40","Noted","INC",null,"TST 31"]
["TST-2017-0242R01","allow_TTCN-3_tool_extensions","Easy Global Market","2017-09-20T15:04:46","Noted","INC",null,"TST 31"]
["TST-2017-0234R02","Added_missing_descriptorRepresentation_attribute_in_TR-0045","NEC","2017-09-20T15:45:36","Noted","CR",null,"TST 31"]
["TST-2017-0234R03","Added_missing_descriptorRepresentation_attribute_in_TR-0045","NEC (Convida)","2017-09-21T03:49:16","Noted","CR",null,"TST 31"]
["TST-2017-0234R04","Added_missing_descriptorRepresentation_attribute_in_TR-0045","NEC (Convida)","2017-09-21T03:56:59","Agreed","CR",null,"TST 31"]
["TST-2017-0239R01","TST 31 docs allocation","TST Chair (KETI)","2017-09-21T04:00:03","Draft","AG",null,"TST 31"]
["TST-2017-0243","TR-0045_Baseline_v0.3.1","NEC","2017-09-21T05:06:49","Draft","INC",null,"TST 31"]
["TST-2017-0244","Preparation_of_ TS-0018_v1_0_0","Miguel Angel Reina Ortega, ETSI","2017-09-21T07:22:40","Draft","CR",null,"TST 31"]
["TST-2017-0241","TR-0039 Baseline v0.0.5 after TST31","Maciej Goluch (Orange)","2017-09-21T08:01:07","Draft","CR",null,"TST 31"]