{"text_format":"1","workbook":"xlsx","n_sheets":10,"sheets":["Document Allocation","logistics","AllDocs","TP","REQ","ARC","PRO","SEC","MAS","TST"],"not_rendered":{"charts":0,"images":1,"macros":1,"external_links":0,"defined_names":23,"comments":0,"pivot_tables":0},"unopened":[],"bounds":{"document_bytes":16777216,"sheet_cells":100000,"rows_first":2000,"rows_last":500,"rows_between":2000,"halvings":0,"cell_chars":16384,"cell_head_chars":4096},"cells_cut":0,"cells_raw":0,"read":"whole","date_system":"1900"}

{"sheet":"Document Allocation","index":0,"n_rows":118,"n_cols":13,"rows_kept":118,"cut":false,"hidden":false,"merged":[]}
["Slot","Room","WG","Doc-Number","Title","Source","Upload Time","WG disposition (Agreed, Noted, Postponed, Withdrawn)","Type (INC, CR, AG, MIN)","Work Item","Rel","Purpose","Notes"]
["Mon-3 (13:30-15:00)",{"$f":"VLOOKUP(A2,logistics!G:I,2,0)","v":1},{"$f":"VLOOKUP(A2,logistics!G:I,3,0)","v":"MAS "},"MAS-2017-0224",{"$f":"VLOOKUP(D2,AllDocs!A:D,2,0)","v":"MAS#31 Agenda"},{"$f":"VLOOKUP(D2,AllDocs!A:D,3,0)","v":"Yongjing Zhang (Huawei, MAS Chair)"},{"$f":"VLOOKUP(D2,AllDocs!A:D,4,0)","v":"2017-09-12T13:12:50"},"Noted",{"$f":"VLOOKUP(D2,AllDocs!A:F,6,0)","v":"AG"}]
["Mon-3 (13:30-15:00)",{"$f":"VLOOKUP(A3,logistics!G:I,2,0)","v":1},{"$f":"VLOOKUP(A3,logistics!G:I,3,0)","v":"MAS "},"MAS-2017-0224R01",{"$f":"VLOOKUP(D3,AllDocs!A:D,2,0)","v":"MAS#31 Agenda"},{"$f":"VLOOKUP(D3,AllDocs!A:D,3,0)","v":"Yongjing Zhang (Huawei, MAS Chair)"},{"$f":"VLOOKUP(D3,AllDocs!A:D,4,0)","v":"2017-09-18T09:39:25"},"Agreed",{"$f":"VLOOKUP(D3,AllDocs!A:F,6,0)","v":"AG"}]
["Mon-3 (13:30-15:00)",{"$f":"VLOOKUP(A4,logistics!G:I,2,0)","v":1},{"$f":"VLOOKUP(A4,logistics!G:I,3,0)","v":"MAS "},"MAS-2017-0225R01",{"$f":"VLOOKUP(D4,AllDocs!A:D,2,0)","v":"MAS#31 Doc Allocation"},{"$f":"VLOOKUP(D4,AllDocs!A:D,3,0)","v":"Yongjing Zhang (Huawei, MAS Chair)"},{"$f":"VLOOKUP(D4,AllDocs!A:D,4,0)","v":"2017-09-15T07:40:10"},"Noted",{"$f":"VLOOKUP(D4,AllDocs!A:F,6,0)","v":"AG"}]
["Mon-3 (13:30-15:00)",{"$f":"VLOOKUP(A5,logistics!G:I,2,0)","v":1},{"$f":"VLOOKUP(A5,logistics!G:I,3,0)","v":"MAS "},"MAS-2017-0225R02",{"$f":"VLOOKUP(D5,AllDocs!A:D,2,0)","v":"MAS#31 Doc Allocation"},{"$f":"VLOOKUP(D5,AllDocs!A:D,3,0)","v":"Yongjing Zhang (Huawei, MAS Chair)"},{"$f":"VLOOKUP(D5,AllDocs!A:D,4,0)","v":"2017-09-18T09:40:43"},"Noted",{"$f":"VLOOKUP(D5,AllDocs!A:F,6,0)","v":"AG"}]
["Mon-3 (13:30-15:00)",{"$f":"VLOOKUP(A6,logistics!G:I,2,0)","v":1},{"$f":"VLOOKUP(A6,logistics!G:I,3,0)","v":"MAS "},"MAS-2017-0221",{"$f":"VLOOKUP(D6,AllDocs!A:D,2,0)","v":"semanticMashupInstance Resource Clarification"},{"$f":"VLOOKUP(D6,AllDocs!A:D,3,0)","v":"Convida"},{"$f":"VLOOKUP(D6,AllDocs!A:D,4,0)","v":"2017-09-11T01:37:46"},"Agreed",{"$f":"VLOOKUP(D6,AllDocs!A:F,6,0)","v":"CR"},"TS-0034 (WI-0053)",3]
["Mon-3 (13:30-15:00)",{"$f":"VLOOKUP(A7,logistics!G:I,2,0)","v":1},{"$f":"VLOOKUP(A7,logistics!G:I,3,0)","v":"MAS "},"MAS-2017-0222",{"$f":"VLOOKUP(D7,AllDocs!A:D,2,0)","v":"New WI on Industrial Domain Information Model"},{"$f":"VLOOKUP(D7,AllDocs!A:D,3,0)","v":"Hitachi"},{"$f":"VLOOKUP(D7,AllDocs!A:D,4,0)","v":"2017-09-11T01:48:20"},"Noted",{"$f":"VLOOKUP(D7,AllDocs!A:F,6,0)","v":"INC"},"Generic",4]
["Mon-3 (13:30-15:00)",{"$f":"VLOOKUP(A8,logistics!G:I,2,0)","v":1},{"$f":"VLOOKUP(A8,logistics!G:I,3,0)","v":"MAS "},"MAS-2017-0222R01",{"$f":"VLOOKUP(D8,AllDocs!A:D,2,0)","v":"New WI on Industrial Domain Information Model"},{"$f":"VLOOKUP(D8,AllDocs!A:D,3,0)","v":"Hitachi"},{"$f":"VLOOKUP(D8,AllDocs!A:D,4,0)","v":"2017-09-11T03:06:28"},"Noted",{"$f":"VLOOKUP(D8,AllDocs!A:F,6,0)","v":"INC"},"Generic",4]
["Mon-3 (13:30-15:00)",{"$f":"VLOOKUP(A9,logistics!G:I,2,0)","v":1},{"$f":"VLOOKUP(A9,logistics!G:I,3,0)","v":"MAS "},"MAS-2017-0222R02",{"$f":"VLOOKUP(D9,AllDocs!A:D,2,0)","v":"New WI on Industrial Domain Information Model"},{"$f":"VLOOKUP(D9,AllDocs!A:D,3,0)","v":"Hitachi"},{"$f":"VLOOKUP(D9,AllDocs!A:D,4,0)","v":"2017-09-18T05:26:26"},"Noted",{"$f":"VLOOKUP(D9,AllDocs!A:F,6,0)","v":"INC"},"Generic",4,null,"1. industrial information mmodels may be out of scope of oneM2M, rather in the scope of Industry 4.0. May need to change the name of the WI, not to misleading.\n2. two steps: mapping directly the inforamtion model to oneM2M, then add semantic features (e.g. annotation)\n3. to modify the WID and present to MAS before TP."]
["Mon-3 (13:30-15:00)",{"$f":"VLOOKUP(A10,logistics!G:I,2,0)","v":1},{"$f":"VLOOKUP(A10,logistics!G:I,3,0)","v":"MAS "},"MAS-2017-0223",{"$f":"VLOOKUP(D10,AllDocs!A:D,2,0)","v":"Adding support managing gallery device"},{"$f":"VLOOKUP(D10,AllDocs!A:D,3,0)","v":"BOE"},{"$f":"VLOOKUP(D10,AllDocs!A:D,4,0)","v":"2017-09-11T06:14:56"},"Noted",{"$f":"VLOOKUP(D10,AllDocs!A:F,6,0)","v":"CR"},"TS-0023 (WI-0056)",3,null,"Suggest to postpone to R4. (coordination with the rapporteur"]
["Mon-3 (13:30-15:00)",{"$f":"VLOOKUP(A11,logistics!G:I,2,0)","v":1},{"$f":"VLOOKUP(A11,logistics!G:I,3,0)","v":"MAS "},"MAS-2017-0226",{"$f":"VLOOKUP(D11,AllDocs!A:D,2,0)","v":"Added semantic check aspects in semantic validation"},{"$f":"VLOOKUP(D11,AllDocs!A:D,3,0)","v":"KT"},{"$f":"VLOOKUP(D11,AllDocs!A:D,4,0)","v":"2017-09-13T20:46:14"},"Noted",{"$f":"VLOOKUP(D11,AllDocs!A:F,6,0)","v":"CR"},"TS-0034 (WI-0053)",3]
["Mon-3 (13:30-15:00)",{"$f":"VLOOKUP(A12,logistics!G:I,2,0)","v":1},{"$f":"VLOOKUP(A12,logistics!G:I,3,0)","v":"MAS "},"MAS-2017-0226R01",{"$f":"VLOOKUP(D12,AllDocs!A:D,2,0)","v":"Added semantic check aspects in semantic validation"},{"$f":"VLOOKUP(D12,AllDocs!A:D,3,0)","v":"KT"},{"$f":"VLOOKUP(D12,AllDocs!A:D,4,0)","v":"2017-09-18T08:06:27"},"Noted",{"$f":"VLOOKUP(D12,AllDocs!A:F,6,0)","v":"CR"},"TS-0034 (WI-0053)",3,null,"R3 doesn't support validation of the Ontologies (classes)\nSuggest to remove Class validation, using a Note instead.\nFurther offline discussion needed.\nR02 expected."]
["Mon-3 (13:30-15:00)",{"$f":"VLOOKUP(A13,logistics!G:I,2,0)","v":1},{"$f":"VLOOKUP(A13,logistics!G:I,3,0)","v":"MAS "},"MAS-2017-0212R01",{"$f":"VLOOKUP(D13,AllDocs!A:D,2,0)","v":"HAIM_modification_for_cookerFood_model"},{"$f":"VLOOKUP(D13,AllDocs!A:D,3,0)","v":"Qualcomm Inc. (TIA)"},{"$f":"VLOOKUP(D13,AllDocs!A:D,4,0)","v":"2017-08-29T04:19:44"},"Agreed",{"$f":"VLOOKUP(D13,AllDocs!A:F,6,0)","v":"CR"},"TS-0023 (WI-0056)",3]
["Mon-5 (17:00-18:30)",{"$f":"VLOOKUP(A14,logistics!G:I,2,0)","v":3},{"$f":"VLOOKUP(A14,logistics!G:I,3,0)","v":"MAS-adhoc"},"MAS-2017-0199R02",{"$f":"VLOOKUP(D14,AllDocs!A:D,2,0)","v":"rewriting TS-0030-Generic-Interworking"},{"$f":"VLOOKUP(D14,AllDocs!A:D,3,0)","v":"NEC"},{"$f":"VLOOKUP(D14,AllDocs!A:D,4,0)","v":"2017-09-13T17:31:18"},null,{"$f":"VLOOKUP(D14,AllDocs!A:F,6,0)","v":"INC"},"TS-0030 (WI-0063)",3,null,"1. naming convention should be revised (regarding instance-numbering) using consistent patterns.\n2. SDT-based interworking and BO-based interworking are already aligned a lot and should be further aligned in the next release (ideally identical). \n3. revision expected."]
["Mon-5 (17:00-18:30)",{"$f":"VLOOKUP(A15,logistics!G:I,2,0)","v":3},{"$f":"VLOOKUP(A15,logistics!G:I,3,0)","v":"MAS-adhoc"},"MAS-2017-0200R01",{"$f":"VLOOKUP(D15,AllDocs!A:D,2,0)","v":"changes to TS-0012 due to rewriting TS-0030-Generic-Interworking"},{"$f":"VLOOKUP(D15,AllDocs!A:D,3,0)","v":"NEC"},{"$f":"VLOOKUP(D15,AllDocs!A:D,4,0)","v":"2017-09-08T19:02:29"},null,{"$f":"VLOOKUP(D15,AllDocs!A:F,6,0)","v":"INC"},"TS-0012 (WI-0063)",3,null,"the change has no impact to SAREF mapping"]
{"$rows_left_out":104}
{"sheet":"logistics","index":1,"n_rows":32,"n_cols":12,"rows_kept":32,"cut":false,"hidden":false,"merged":[]}
["WeekDay","SlotTime","Day","Slot","Time","AllSlots","MAS Slots","Rooms","WGs","WIs","Short Name","Deadline"]
["Mon","9:00-10:30","Mon",1,"9:00-10:30",{"$f":"CONCATENATE(C2,\"-\",D2,\" (\",E2,\")\")","v":"Mon-1 (9:00-10:30)"},{"$f":"IF(COUNTA(I2),CELL(\"contents\",F2),\"\")","v":""},null,null,"TR-0001 (WI-0015)","Use Case Continuation","2017-09-11T14:30:00"]
["Tue","10:30-11:00","Mon",2,"11:00-12:30","Mon-2 (11:00-12:30)",{"$f":"IF(COUNTA(I3),CELL(\"contents\",F3),\"\")","v":""},null,null,"TR-0007 (WI-0053)","Semantic Study"]
["Wed","11:00-12:30","Mon",3,"13:30-15:00",{"$f":"CONCATENATE(C4,\"-\",D4,\" (\",E4,\")\")","v":"Mon-3 (13:30-15:00)"},"Mon-3 (13:30-15:00)",1,"MAS ","TR-0014 (WI-0018)","oneM2M AllJoyn Interworking"]
["Thu","12:30-13:30","Mon",4,"15:30-17:00",{"$f":"CONCATENATE(C5,\"-\",D5,\" (\",E5,\")\")","v":"Mon-4 (15:30-17:00)"},"",null,null,"TR-0017 (WI-0017)","Home Domain Abstract Information Model"]
["Fri","13:30-15:00","Mon",5,"17:00-18:30","Mon-5 (17:00-18:30)","Mon-5 (17:00-18:30)",3,"MAS-adhoc","TR-0018 (WI-0059)","Industry Domain Enablement"]
[null,"15:00-15:30","Tue",1,"08:30-10:00","Tue-1 (08:30-10:00)",{"$f":"IF(COUNTA(#REF!),CELL(\"contents\",F7),\"\")","v":"Tue-1 (08:30-10:00)"},1,"ARC/MAS","TR-0022 (WI-0043)","Continuation & integration of HGI Smart Home activities"]
[null,"15:30-17:00","Tue",2,"10:30-12:00","Tue-2 (10:30-12:00)","Tue-2 (10:30-12:00)",2,"MAS ","TR-0031 (WI-0052)","LWM2M DM Interworking Enhancement"]
[null,"17:00-18:30","Tue",3,"13:30-15:00",{"$f":"CONCATENATE(C9,\"-\",D9,\" (\",E9,\")\")","v":"Tue-3 (13:30-15:00)"},"Tue-3 (13:30-15:00)",2,"PRO/MAS","TR-0039 (WI-0054)","Developer guide-SDT-based implementation"]
[null,null,"Tue",4,"15:30-17:00","Tue-4 (15:30-17:00)","Tue-4 (15:30-17:00)",3,"MAS-adhoc","TR-0033 (WI-0053)","Study on Enhanced Semantic Enablement"]
[null,"08:30-10:00","Tue",5,"17:00-18:30","Tue-5 (17:00-18:30)","Tue-5 (17:00-18:30)",2,"PRO/MAS","TR-0042 (WI-0071)","WoT Interworking"]
[null,"10:00-10:30","Wed",1,"08:30-10:00","Wed-1 (08:30-10:00)","",null,null,"TR-0043 (WI-0072)","Modbus Interworking"]
[null,"10:30-12:00","Wed",2,"10:30-12:00","Wed-2 (10:30-12:00)","",null,null,"TR-0045 (WI-0054)","Developer Guide: Implementing Semantics"]
[null,"12:00-13:30","Wed",3,"13:30-15:00","Wed-3 (13:30-15:00)","",null,null,"TS-0001 (WI-0002)","Architecture"]
[null,"13:30-15:00","Wed",4,"15:30-17:00","Wed-4 (15:30-17:00)","",null,null,"TS-0002 (WI-0001)","Requirement"]
{"$rows_left_out":18}
{"sheet":"AllDocs","index":2,"n_rows":476,"n_cols":8,"rows_kept":476,"cut":false,"hidden":false,"merged":[]}
["SHORT DOC NB","SHORTNAME","SOURCE","UPLOADED","STATUS","DOC TYPE","VERS","MEETING"]
["ARC-2017-0161","deviceCapability-attributes_RW-R3","C-DOT","2017-04-11T04:18:41","Draft","CR",null,"ARC 31"]
["ARC-2017-0162","deviceCapability-attributes_RW- MIRROR R2","C-DOT","2017-04-11T04:22:18","Draft","CR",null,"ARC 31"]
["PRO-2017-0155","Generic procedure for handling a Request at a receiver R3","KT","2017-07-02T04:26:54","Draft","CR",null,"PRO 31"]
["PRO-2017-0169","Fixed header of MQTT PUBLISH Packet","KT","2017-07-12T14:25:10","Draft","CR",null,"PRO 31"]
["ARC-2017-0296R02","TS-0026_Change_of_Chargeable_Party_Procedures","Convida","2017-07-14T13:13:31","Draft","CR",null,"ARC 31"]
["REQ-2017-0054","CR_TS-0011_Security_Principal","Qualcomm Inc. (TIA)","2017-07-14T16:34:36","Draft","CR",null,"REQ 31"]
["TP-2017-0232","User Services Platform specification available for review","Broadband Forum","2017-07-28T07:37:06","Noted","LS",null,"TP 31"]
["TP-2017-0234","ITU-T Y.oneM2M.DM.BBF","Timothy Carey, Nokia","2017-07-28T15:52:52","Draft","INC",null,"TP 31"]
["TP-2017-0233","ITU-T Y.oneM2M.IWK.LwM2M","Timothy Carey, Nokia","2017-07-28T15:53:16","Draft","INC",null,"TP 31"]
["TP-2017-0234R01","ITU-T Y.oneM2M.DM.BBF","Timothy Carey, Nokia","2017-07-31T13:06:49","Draft","INC",null,"TP 31"]
["TP-2017-0233R01","ITU-T Y.oneM2M.IWK.LwM2M","Timothy Carey, Nokia","2017-07-31T13:07:16","Draft","INC",null,"TP 31"]
["TP-2017-0128R03","Draft_Release_2A_Control_Document","Roland Hechwartner, WPM Convenor","2017-07-31T13:19:42","Draft","INC",null,"TP 31"]
["TP-2017-0235","ITU-T_Y_oneM2M_CT","Roland Hechwartner, Deutsche Telekom","2017-07-31T13:36:35","Draft","INC",null,"TP 31"]
["TP-2017-0233R02","ITU-T Y.oneM2M.IWK.LwM2M","Timothy Carey, Nokia","2017-07-31T13:45:55","Draft","INC",null,"TP 31"]
{"$rows_left_out":462}
{"sheet":"TP","index":3,"n_rows":143,"n_cols":8,"rows_kept":143,"cut":false,"hidden":false,"merged":[]}
["SHORT DOC NB","SHORTNAME","SOURCE","UPLOADED","STATUS","DOC TYPE","VERS","MEETING"]
["TP-2017-0232","User Services Platform specification available for review","Broadband Forum","2017-07-28T07:37:06","Noted","LS",null,"TP 31"]
["TP-2017-0234","ITU-T Y.oneM2M.DM.BBF","Timothy Carey, Nokia","2017-07-28T15:52:52","Draft","INC",null,"TP 31"]
["TP-2017-0233","ITU-T Y.oneM2M.IWK.LwM2M","Timothy Carey, Nokia","2017-07-28T15:53:16","Draft","INC",null,"TP 31"]
["TP-2017-0234R01","ITU-T Y.oneM2M.DM.BBF","Timothy Carey, Nokia","2017-07-31T13:06:49","Draft","INC",null,"TP 31"]
["TP-2017-0233R01","ITU-T Y.oneM2M.IWK.LwM2M","Timothy Carey, Nokia","2017-07-31T13:07:16","Draft","INC",null,"TP 31"]
["TP-2017-0128R03","Draft_Release_2A_Control_Document","Roland Hechwartner, WPM Convenor","2017-07-31T13:19:42","Draft","INC",null,"TP 31"]
["TP-2017-0235","ITU-T_Y_oneM2M_CT","Roland Hechwartner, Deutsche Telekom","2017-07-31T13:36:35","Draft","INC",null,"TP 31"]
["TP-2017-0233R02","ITU-T Y.oneM2M.IWK.LwM2M","Timothy Carey, Nokia","2017-07-31T13:45:55","Draft","INC",null,"TP 31"]
["TP-2017-0234R02","ITU-T Y.oneM2M.DM.BBF","Timothy Carey, Nokia","2017-07-31T13:46:21","Draft","INC",null,"TP 31"]
["TP-2017-0236","ITU Y.oneM2M.UCC","Convida, KDDI","2017-07-31T14:16:27","Draft","CR",null,"TP 31"]
["TP-2017-0234R03","ITU-T Y.oneM2M.DM.BBF","Timothy Carey, Nokia","2017-08-02T10:22:47","Draft","INC",null,"TP 31"]
["TP-2017-0233R03","ITU-T Y.oneM2M.IWK.LwM2M","Timothy Carey, Nokia","2017-08-02T10:23:33","Draft","INC",null,"TP 31"]
["TP-2017-0236R01","ITU-T Y.oneM2M.UCC","Convida, KDDI, Nokia","2017-08-02T12:27:21","Draft","CR",null,"TP 31"]
["TP-2017-0236R02","ITU-T Y.oneM2M.UCC","Convida, KDDI, Nokia","2017-08-04T15:28:16","Draft","CR",null,"TP 31"]
{"$rows_left_out":129}
{"sheet":"REQ","index":4,"n_rows":6,"n_cols":8,"rows_kept":6,"cut":false,"hidden":false,"merged":[]}
["SHORT DOC NB","SHORTNAME","SOURCE","UPLOADED","STATUS","DOC TYPE","VERS","MEETING"]
["REQ-2017-0054","CR_TS-0011_Security_Principal","Qualcomm Inc. (TIA)","2017-07-14T16:34:36","Draft","CR",null,"REQ 31"]
["REQ-2017-0055","Draft-TR-0026-Vehicular_Domain_Enablement_v_0_10_1","KDDI, Convida, Huawei Technologies","2017-08-11T06:26:10","Agreed","CR",null,"REQ 31"]
["REQ-2017-0056","TS-0002-Requirements-V3_1_0","Huawei Technologies Co., Ltd.","2017-09-11T03:38:37","Draft","INC",null,"REQ 31"]
["REQ-2017-0057","REQ 31 Doc Allocation","Shelby Kiewel, WG1 Chairman, iconectiv","2017-09-15T21:21:21","Draft","AG",null,"REQ 31"]
["REQ-2017-0058","REQ31 Agenda","Shelby Kiewel, WG1 Chairman, iconectiv","2017-09-15T21:30:35","Draft","AG",null,"REQ 31"]

{"sheet":"ARC","index":5,"n_rows":95,"n_cols":8,"rows_kept":95,"cut":false,"hidden":false,"merged":[]}
["SHORT DOC NB","SHORTNAME","SOURCE","UPLOADED","STATUS","DOC TYPE","VERS","MEETING"]
["ARC-2017-0161","deviceCapability-attributes_RW-R3","C-DOT","2017-04-11T04:18:41","Draft","CR",null,"ARC 31"]
["ARC-2017-0162","deviceCapability-attributes_RW- MIRROR R2","C-DOT","2017-04-11T04:22:18","Draft","CR",null,"ARC 31"]
["ARC-2017-0296R02","TS-0026_Change_of_Chargeable_Party_Procedures","Convida","2017-07-14T13:13:31","Draft","CR",null,"ARC 31"]
["ARC-2017-0341","ScheduleResourceEditorialCleanup","Convida","2017-08-03T11:04:13","Noted","CR",null,"ARC 31"]
["ARC-2017-0344R01","Clarification_on_M2M-Service-Profile-Identifier","C-DOT","2017-08-09T08:36:53","Draft","CR",null,"ARC 31"]
["ARC-2017-0349","TS-0001-mgmtObj_firmware_software_R3","C-DOT","2017-08-16T12:33:59","Noted","CR",null,"ARC 31"]
["ARC-2017-0350","TS-0001-mgmtObj_firmware_software_MIRROR_R2","C-DOT","2017-08-16T12:35:33","Noted","CR",null,"ARC 31"]
["ARC-2017-0345R01","clause10.2.4.9 table update","Convida","2017-08-31T14:52:09","Agreed","CR",null,"ARC 31"]
["ARC-2017-0184R03","StorageBasedEventClarification_R3","Convida","2017-08-31T14:56:36","Draft","CR",null,"ARC 31"]
["ARC-2017-0355","CR_SubGroupMapping","C-DOT & Huawei","2017-09-04T08:39:47","Draft","CR",null,"ARC 31"]
["ARC-2017-0356","DiscoveryProcedures_Corrections","C-DOT","2017-09-04T08:42:08","Agreed","CR",null,"ARC 31"]
["ARC-2017-0357","ContentSizeTimeInstance","C-DOT","2017-09-06T04:39:22","Draft","CR",null,"ARC 31"]
["ARC-2017-0358","PrimitiveContentOfRequestResource","C-DOT","2017-09-06T04:42:26","Draft","CR",null,"ARC 31"]
["ARC-2017-0357R01","ContentSizeTimeSeriesInstance","C-DOT","2017-09-07T09:18:43","Draft","CR",null,"ARC 31"]
{"$rows_left_out":81}
{"sheet":"PRO","index":6,"n_rows":156,"n_cols":8,"rows_kept":156,"cut":false,"hidden":false,"merged":[]}
["SHORT DOC NB","SHORTNAME","SOURCE","UPLOADED","STATUS","DOC TYPE","VERS","MEETING"]
["PRO-2017-0155","Generic procedure for handling a Request at a receiver R3","KT","2017-07-02T04:26:54","Draft","CR",null,"PRO 31"]
["PRO-2017-0169","Fixed header of MQTT PUBLISH Packet","KT","2017-07-12T14:25:10","Draft","CR",null,"PRO 31"]
["PRO-2017-0185","CoAP Content-Format ID","QUALCOMM Inc. (TIA)","2017-08-01T04:47:57","Draft","CR",null,"PRO 31"]
["PRO-2017-0090R02","NewEventNotificationCriteria(R3)","C-DOT","2017-08-01T04:54:19","Agreed","CR",null,"PRO 31"]
["PRO-2017-0191","deviceInfo_attributes_R3","C-DOT","2017-08-08T12:06:41","Draft","CR",null,"PRO 31"]
["PRO-2017-0199","AERegistration_Request","C-DOT","2017-09-04T08:45:08","Noted","CR",null,"PRO 31"]
["PRO-2017-0200","CR_SubGroupMapping","C-DOT","2017-09-04T09:09:37","Draft","CR",null,"PRO 31"]
["PRO-2017-0201","mgmtObj_update","C-DOT","2017-09-05T09:37:07","Draft","CR",null,"PRO 31"]
["PRO-2017-0202","notificationForwardingURI_R3","C-DOT","2017-09-05T10:44:26","Draft","CR",null,"PRO 31"]
["PRO-2017-0203","discovery_warningInfo","C-DOT","2017-09-05T11:17:41","Noted","CR",null,"PRO 31"]
["PRO-2017-0206","mgmtObj_update_attributes_error","C-DOT","2017-09-06T04:38:04","Draft","CR",null,"PRO 31"]
["PRO-2017-0207","CheckSupportedResourceType","C-DOT","2017-09-06T05:35:48","Draft","CR",null,"PRO 31"]
["PRO-2017-0208","ContentSizeTimeInstance","C-DOT","2017-09-06T05:37:19","Draft","CR",null,"PRO 31"]
["PRO-2017-0209","GroupMemberValidation","C-DOT","2017-09-06T05:38:52","Draft","CR",null,"PRO 31"]
{"$rows_left_out":142}
{"sheet":"SEC","index":7,"n_rows":17,"n_cols":8,"rows_kept":17,"cut":false,"hidden":false,"merged":[]}
["SHORT DOC NB","SHORTNAME","SOURCE","UPLOADED","STATUS","DOC TYPE","VERS","MEETING"]
["SEC-2017-0128","New TR Baseline for WI 0073 App-ID Registry Function","Ian Deakin, iconectiv","2017-09-08T01:35:17","Draft","CR",null,"SEC 31"]
["SEC-2017-0129","Revision of PPM for Rel3","KDDI","2017-09-11T12:41:34","Draft","CR",null,"SEC 31"]
["SEC-2017-0130","App-ID Registry Function TR intro","iconectiv","2017-09-13T15:34:41","Draft","INC",null,"SEC 31"]
["SEC-2017-0131","App-ID Registry Function TR use case 1","iconectiv","2017-09-13T15:36:04","Draft","AG",null,"SEC 31"]
["SEC-2017-0132","App-ID Registry Function TR use case 2","iconectiv","2017-09-13T15:36:40","Draft","INC",null,"SEC 31"]
["SEC-2017-0133","App-ID Registry Function TR use case 1","iconecitv","2017-09-13T15:38:36","Withdrawn","INC",null,"SEC 31"]
["SEC-2017-0134","App-ID Registry Function TR use case 3","iconectiv","2017-09-13T15:39:18","Draft","INC",null,"SEC 31"]
["SEC-2017-0135","App-ID Registry Function TR use case 4","iconectiv","2017-09-13T15:40:27","Draft","INC",null,"SEC 31"]
["SEC-2017-0136","App-ID Registry Function TR use case 5","iconectiv","2017-09-13T15:57:24","Draft","INC",null,"SEC 31"]
["SEC-2017-0137","SEC 31 F2F meeting Agenda","WG Chair (Gemalto)","2017-09-15T08:24:44","Noted","AG",null,"SEC 31"]
["SEC-2017-0138","CR TR-0038 Security Developers Guide Cleanup","Gemalto","2017-09-15T12:52:57","Draft","CR",null,"SEC 31"]
["SEC-2017-0137R01","SEC 31 F2F meeting Agenda","WG Chair (Gemalto)","2017-09-15T16:43:49","Draft","AG",null,"SEC 31"]
["SEC-2017-0139","TS-0016_CR_SE-Resource","G+D","2017-09-15T17:42:43","Draft","CR",null,"SEC 31"]
["SEC-2017-0140","CR TS-0003 new ECC","Orange","2017-09-17T13:06:49","Draft","CR",null,"SEC 31"]
{"$rows_left_out":3}
{"sheet":"MAS","index":8,"n_rows":37,"n_cols":8,"rows_kept":37,"cut":false,"hidden":false,"merged":[]}
["SHORT DOC NB","SHORTNAME","SOURCE","UPLOADED","STATUS","DOC TYPE","VERS","MEETING"]
["MAS-2017-0212R01","HAIM_modification_for_cookerFood_model","Qualcomm Inc. (TIA)","2017-08-29T04:19:44","Draft","CR",null,"MAS 31"]
["MAS-2017-0199R01","rewriting TS-0030-Generic-Interworking","NEC","2017-09-08T18:48:17","Noted","INC",null,"MAS 31"]
["MAS-2017-0200R01","changes to TS-0012 due to rewriting TS-0030-Generic-Interworking","NEC","2017-09-08T19:02:29","Noted","INC",null,"MAS 31"]
["MAS-2017-0221","semanticMashupInstance Resource Clarification","Convida","2017-09-11T01:37:46","Agreed","CR",null,"MAS 31"]
["MAS-2017-0222","New WI on Industrial Domain Information Model","Hitachi","2017-09-11T01:48:20","Noted","INC",null,"MAS 31"]
["MAS-2017-0222R01","New WI on Industrial Domain Information Model","Hitachi","2017-09-11T03:06:28","Noted","INC",null,"MAS 31"]
["MAS-2017-0223","Adding support managing gallery device","BOE","2017-09-11T06:14:56","Noted","CR",null,"MAS 31"]
["MAS-2017-0224","MAS#31 Agenda","Yongjing Zhang (Huawei, MAS Chair)","2017-09-12T13:12:50","Noted","AG",null,"MAS 31"]
["MAS-2017-0225","MAS#31 Doc Allocation","Yongjing Zhang (Huawei, MAS Chair)","2017-09-12T13:13:03","Noted","AG",null,"MAS 31"]
["MAS-2017-0199R02","rewriting TS-0030-Generic-Interworking","NEC","2017-09-13T17:31:18","Noted","INC",null,"MAS 31"]
["MAS-2017-0226","Added semantic check aspects in semantic validation","KT","2017-09-13T20:46:14","Noted","CR",null,"MAS 31"]
["MAS-2017-0227","TS-0006-mgmtCmd_execResult(R3)","C-DOT","2017-09-14T11:43:08","Draft","CR",null,"MAS 31"]
["MAS-2017-0228","TS-0006-mgmtCmd_execResult(R2)","C-DOT","2017-09-14T11:44:57","Draft","CR",null,"MAS 31"]
["MAS-2017-0225R01","MAS#31 Doc Allocation","Yongjing Zhang (Huawei, MAS Chair)","2017-09-15T07:40:10","Noted","AG",null,"MAS 31"]
{"$rows_left_out":23}
{"sheet":"TST","index":9,"n_rows":28,"n_cols":8,"rows_kept":28,"cut":false,"hidden":false,"merged":[]}
["SHORT DOC NB","SHORTNAME","SOURCE","UPLOADED","STATUS","DOC TYPE","VERS","MEETING"]
["TST-2017-0221R01","Test specs release management","Miguel Angel Reina Ortega, ETSI","2017-08-30T15:02:32","Noted","INC",null,"TST 31"]
["TST-2017-0227","Developer_Guide_of_3GPP_Interworking_Skeleton","Huawei Technologies Co., Ltd.","2017-09-11T01:54:01","Agreed","INC",null,"TST 31"]
["TST-2017-0228","semanticInterop-R2","Convida","2017-09-11T20:17:51","Draft","CR",null,"TST 31"]
["TST-2017-0229","TS-0017_new_baseline_v_0_1_0","KETI","2017-09-13T02:49:02","Agreed","INC",null,"TST 31"]
["TST-2017-0230","TS-0018_new_baseline_v_0_5_0","KETI","2017-09-13T02:51:17","Agreed","INC",null,"TST 31"]
["TST-2017-0231","TS-0018_Changes_from_STF531","Miguel Angel Reina Ortega, ETSI","2017-09-13T07:08:15","Agreed","CR",null,"TST 31"]
["TST-2017-0232","Final corrections of SDT-IPE DvprGuide","Maciej Goluch (Orange)","2017-09-13T09:56:14","Noted","CR",null,"TST 31"]
["TST-2017-0233","TR-0045 Baseline after editHelp","NEC","2017-09-13T13:46:01","Agreed","INC",null,"TST 31"]
["TST-2017-0234","Added_missing_descriptorRepresentation_attribute_in_TR-0045","NEC","2017-09-13T14:28:03","Noted","CR",null,"TST 31"]
["TST-2017-0235","New_baseline_of_TR-0034_after_editHelp","Shane HE, Nokia","2017-09-14T13:07:37","Agreed","INC",null,"TST 31"]
["TST-2017-0236","TS-0019-ATS-Baseline-V0_4_0","Miguel Angel Reina Ortega, ETSI","2017-09-15T10:02:45","Agreed","INC",null,"TST 31"]
["TST-2017-0237","CR-TS-0013 update test descriptions for flexContainer","TTA (Heejin Joung)","2017-09-16T13:32:52","Agreed","CR",null,"TST 31"]
["TST-2017-0238","TST 31 Agenda","TST Chair (KETI)","2017-09-17T04:16:27","Noted","AG",null,"TST 31"]
["TST-2017-0239","TST 31 docs allocation","TST Chair (KETI)","2017-09-17T05:06:52","Noted","AG",null,"TST 31"]
{"$rows_left_out":13}