{"text_format":"1","workbook":"xlsx","n_sheets":10,"sheets":["Document Allocation","logistics","AllDocs","TP","REQ","ARC","PRO","SEC","MAS","TST"],"not_rendered":{"charts":0,"images":1,"macros":1,"external_links":0,"defined_names":31,"comments":0,"pivot_tables":0},"unopened":[],"bounds":{"document_bytes":16777216,"sheet_cells":100000,"rows_first":2000,"rows_last":500,"rows_between":2000,"halvings":0,"cell_chars":16384,"cell_head_chars":4096},"cells_cut":0,"cells_raw":0,"read":"whole","date_system":"1900"}

{"sheet":"Document Allocation","index":0,"n_rows":155,"n_cols":13,"rows_kept":155,"cut":false,"hidden":false,"merged":[]}
["Slot","Room","WG","Doc-Number","Title","Source","Upload Time","WG disposition (Agreed, Noted, Postponed, Withdrawn)","Type (INC, CR, AG, MIN)","Work Item","Rel","Purpose","Notes"]
["Mon-2 (11:00-12:30)",{"$f":"VLOOKUP(A2,logistics!G:I,2,0)","v":2},{"$f":"VLOOKUP(A2,logistics!G:I,3,0)","v":"MAS"},"MAS-2018-0087",{"$f":"VLOOKUP(D2,AllDocs!A:D,2,0)","v":"Agenda MAS#36"},{"$f":"VLOOKUP(D2,AllDocs!A:D,3,0)","v":"Yongjing Zhang (Huawei, MAS Chair)"},{"$f":"VLOOKUP(D2,AllDocs!A:D,4,0)","v":"2018-07-09T13:16:14"},"Noted",{"$f":"VLOOKUP(D2,AllDocs!A:F,6,0)","v":"AG"}]
["Mon-2 (11:00-12:30)",{"$f":"VLOOKUP(A3,logistics!G:I,2,0)","v":2},{"$f":"VLOOKUP(A3,logistics!G:I,3,0)","v":"MAS"},"MAS-2018-0087R01",{"$f":"VLOOKUP(D3,AllDocs!A:D,2,0)","v":"Agenda MAS#36"},{"$f":"VLOOKUP(D3,AllDocs!A:D,3,0)","v":"Yongjing Zhang (Huawei, MAS Chair)"},{"$f":"VLOOKUP(D3,AllDocs!A:D,4,0)","v":"2018-07-16T15:23:10"},"Agreed",{"$f":"VLOOKUP(D3,AllDocs!A:F,6,0)","v":"AG"}]
["Mon-2 (11:00-12:30)",{"$f":"VLOOKUP(A4,logistics!G:I,2,0)","v":2},{"$f":"VLOOKUP(A4,logistics!G:I,3,0)","v":"MAS"},"MAS-2018-0088",{"$f":"VLOOKUP(D4,AllDocs!A:D,2,0)","v":"Doc Allocation MAS#36"},{"$f":"VLOOKUP(D4,AllDocs!A:D,3,0)","v":"Yongjing Zhang (Huawei, MAS Chair)"},{"$f":"VLOOKUP(D4,AllDocs!A:D,4,0)","v":"2018-07-09T13:16:26"},"Noted",{"$f":"VLOOKUP(D4,AllDocs!A:F,6,0)","v":"AG"}]
["Mon-2 (11:00-12:30)",{"$f":"VLOOKUP(A5,logistics!G:I,2,0)","v":2},{"$f":"VLOOKUP(A5,logistics!G:I,3,0)","v":"MAS"},"MAS-2018-0088R01",{"$f":"VLOOKUP(D5,AllDocs!A:D,2,0)","v":"Doc Allocation MAS#36"},{"$f":"VLOOKUP(D5,AllDocs!A:D,3,0)","v":"Yongjing Zhang (Huawei, MAS Chair)"},{"$f":"VLOOKUP(D5,AllDocs!A:D,4,0)","v":"2018-07-16T15:23:44"},"Noted",{"$f":"VLOOKUP(D5,AllDocs!A:F,6,0)","v":"AG"}]
["Mon-2 (11:00-12:30)",{"$f":"VLOOKUP(A6,logistics!G:I,2,0)","v":2},{"$f":"VLOOKUP(A6,logistics!G:I,3,0)","v":"MAS"},"MAS-2018-0077R01",{"$f":"VLOOKUP(D6,AllDocs!A:D,2,0)","v":"WI-0053 Update"},{"$f":"VLOOKUP(D6,AllDocs!A:D,3,0)","v":"Convida"},{"$f":"VLOOKUP(D6,AllDocs!A:D,4,0)","v":"2018-07-02T15:37:18"},"Agreed",{"$f":"VLOOKUP(D6,AllDocs!A:F,6,0)","v":"CR"},"TS-0034 (WI-0053)",null,null,"To be sent to TP for approval."]
["Mon-2 (11:00-12:30)",{"$f":"VLOOKUP(A7,logistics!G:I,2,0)","v":2},{"$f":"VLOOKUP(A7,logistics!G:I,3,0)","v":"MAS"},"MAS-2018-0096",{"$f":"VLOOKUP(D7,AllDocs!A:D,2,0)","v":"Triggering Continuous Reasoning Process"},{"$f":"VLOOKUP(D7,AllDocs!A:D,3,0)","v":"Convida Wireless"},{"$f":"VLOOKUP(D7,AllDocs!A:D,4,0)","v":"2018-07-07T18:48:36"},"Noted",{"$f":"VLOOKUP(D7,AllDocs!A:F,6,0)","v":"INC"},"TR-0033 (WI-0053)",null,null,"Use different term than 'triggering'.\nAlign the text with box scope in step 9.\nrevision expected."]
["Mon-2 (11:00-12:30)",{"$f":"VLOOKUP(A8,logistics!G:I,2,0)","v":2},{"$f":"VLOOKUP(A8,logistics!G:I,3,0)","v":"MAS"},"MAS-2018-0097",{"$f":"VLOOKUP(D8,AllDocs!A:D,2,0)","v":"TR-0049_v0.1.0_New_Baseline"},{"$f":"VLOOKUP(D8,AllDocs!A:D,3,0)","v":"Hitachi"},{"$f":"VLOOKUP(D8,AllDocs!A:D,4,0)","v":"2018-07-09T02:05:38"},"Agreed",{"$f":"VLOOKUP(D8,AllDocs!A:F,6,0)","v":"CR"},"TR-0049 (WI-0075)"]
["Mon-2 (11:00-12:30)",{"$f":"VLOOKUP(A9,logistics!G:I,2,0)","v":2},{"$f":"VLOOKUP(A9,logistics!G:I,3,0)","v":"MAS"},"MAS-2018-0105",{"$f":"VLOOKUP(D9,AllDocs!A:D,2,0)","v":"Changes in DataPoints tables structure"},{"$f":"VLOOKUP(D9,AllDocs!A:D,3,0)","v":"Orange"},{"$f":"VLOOKUP(D9,AllDocs!A:D,4,0)","v":"2018-07-12T12:04:15"},"Noted",{"$f":"VLOOKUP(D9,AllDocs!A:F,6,0)","v":"CR"},"TS-0023 (WI-0084)",4]
["Mon-2 (11:00-12:30)",{"$f":"VLOOKUP(A10,logistics!G:I,2,0)","v":2},{"$f":"VLOOKUP(A10,logistics!G:I,3,0)","v":"MAS"},"MAS-2018-0066R03",{"$f":"VLOOKUP(D10,AllDocs!A:D,2,0)","v":{"$error":"#N/A"}},{"$f":"VLOOKUP(D10,AllDocs!A:D,3,0)","v":{"$error":"#N/A"}},{"$f":"VLOOKUP(D10,AllDocs!A:D,4,0)","v":{"$error":"#N/A"}},"Noted",{"$f":"VLOOKUP(D10,AllDocs!A:F,6,0)","v":{"$error":"#N/A"}}]
["Mon-2 (11:00-12:30)",{"$f":"VLOOKUP(A11,logistics!G:I,2,0)","v":2},{"$f":"VLOOKUP(A11,logistics!G:I,3,0)","v":"MAS"},"MAS-2018-0066R04",{"$f":"VLOOKUP(D11,AllDocs!A:D,2,0)","v":{"$error":"#N/A"}},{"$f":"VLOOKUP(D11,AllDocs!A:D,3,0)","v":{"$error":"#N/A"}},{"$f":"VLOOKUP(D11,AllDocs!A:D,4,0)","v":{"$error":"#N/A"}},"Agreed",{"$f":"VLOOKUP(D11,AllDocs!A:F,6,0)","v":{"$error":"#N/A"}},null,null,null,"Pre-agreed. R04 should refer to the architecture diagrma in TS-0022. R04 would be sent to TP for approval (SEC WG shall be informed, and email approval could be used if necessary)."]
["Mon-4 (16:00-17:30)",{"$f":"VLOOKUP(A12,logistics!G:I,2,0)","v":2},{"$f":"VLOOKUP(A12,logistics!G:I,3,0)","v":"MAS"},"MAS-2018-0094",{"$f":"VLOOKUP(D12,AllDocs!A:D,2,0)","v":"Smart City model - street light"},{"$f":"VLOOKUP(D12,AllDocs!A:D,3,0)","v":"Yongjing Zhang (Huawei)"},{"$f":"VLOOKUP(D12,AllDocs!A:D,4,0)","v":"2018-07-09T10:58:14"},"Noted",{"$f":"VLOOKUP(D12,AllDocs!A:F,6,0)","v":"CR"},"TS-0023 (WI-0084)",4]
["Mon-4 (16:00-17:30)",{"$f":"VLOOKUP(A13,logistics!G:I,2,0)","v":2},{"$f":"VLOOKUP(A13,logistics!G:I,3,0)","v":"MAS"},"MAS-2018-0094R01",{"$f":"VLOOKUP(D13,AllDocs!A:D,2,0)","v":"Smart City model - street light"},{"$f":"VLOOKUP(D13,AllDocs!A:D,3,0)","v":"Yongjing Zhang (Huawei)"},{"$f":"VLOOKUP(D13,AllDocs!A:D,4,0)","v":"2018-07-10T09:09:14"},"Noted",{"$f":"VLOOKUP(D13,AllDocs!A:F,6,0)","v":"CR"},"TS-0023 (WI-0084)",4]
["Mon-4 (16:00-17:30)",{"$f":"VLOOKUP(A14,logistics!G:I,2,0)","v":2},{"$f":"VLOOKUP(A14,logistics!G:I,3,0)","v":"MAS"},"MAS-2018-0094R02",{"$f":"VLOOKUP(D14,AllDocs!A:D,2,0)","v":"Smart City model - street light"},{"$f":"VLOOKUP(D14,AllDocs!A:D,3,0)","v":"Yongjing Zhang (Huawei)"},{"$f":"VLOOKUP(D14,AllDocs!A:D,4,0)","v":"2018-07-16T23:58:01"},"Agreed",{"$f":"VLOOKUP(D14,AllDocs!A:F,6,0)","v":"CR"},"TS-0023 (WI-0084)",4]
["Mon-4 (16:00-17:30)",{"$f":"VLOOKUP(A15,logistics!G:I,2,0)","v":2},{"$f":"VLOOKUP(A15,logistics!G:I,3,0)","v":"MAS"},"MAS-2018-0089",{"$f":"VLOOKUP(D15,AllDocs!A:D,2,0)","v":"Smart City model - gas meter"},{"$f":"VLOOKUP(D15,AllDocs!A:D,3,0)","v":"Yongjing Zhang (Huawei)"},{"$f":"VLOOKUP(D15,AllDocs!A:D,4,0)","v":"2018-07-09T11:02:06"},"Noted",{"$f":"VLOOKUP(D15,AllDocs!A:F,6,0)","v":"CR"},"TS-0023 (WI-0084)",4]
["Mon-4 (16:00-17:30)",{"$f":"VLOOKUP(A16,logistics!G:I,2,0)","v":2},{"$f":"VLOOKUP(A16,logistics!G:I,3,0)","v":"MAS"},"MAS-2018-0089R01",{"$f":"VLOOKUP(D16,AllDocs!A:D,2,0)","v":"Smart City model - gas meter"},{"$f":"VLOOKUP(D16,AllDocs!A:D,3,0)","v":"Yongjing Zhang (Huawei)"},{"$f":"VLOOKUP(D16,AllDocs!A:D,4,0)","v":"2018-07-16T23:58:43"},"Agreed",{"$f":"VLOOKUP(D16,AllDocs!A:F,6,0)","v":"CR"},"TS-0023 (WI-0084)",4]
["Mon-4 (16:00-17:30)",{"$f":"VLOOKUP(A17,logistics!G:I,2,0)","v":2},{"$f":"VLOOKUP(A17,logistics!G:I,3,0)","v":"MAS"},"MAS-2018-0093",{"$f":"VLOOKUP(D17,AllDocs!A:D,2,0)","v":"Smart City model - air quality monitor"},{"$f":"VLOOKUP(D17,AllDocs!A:D,3,0)","v":"Yongjing Zhang (Huawei), Yawen Niu (CMCC)"},{"$f":"VLOOKUP(D17,AllDocs!A:D,4,0)","v":"2018-07-09T10:59:29"},"Noted",{"$f":"VLOOKUP(D17,AllDocs!A:F,6,0)","v":"CR"},"TS-0023 (WI-0084)",4]
["Mon-4 (16:00-17:30)",{"$f":"VLOOKUP(A18,logistics!G:I,2,0)","v":2},{"$f":"VLOOKUP(A18,logistics!G:I,3,0)","v":"MAS"},"MAS-2018-0093R01",{"$f":"VLOOKUP(D18,AllDocs!A:D,2,0)","v":"Smart City model - air quality monitor"},{"$f":"VLOOKUP(D18,AllDocs!A:D,3,0)","v":"Yongjing Zhang (Huawei), Yawen Niu (CMCC)"},{"$f":"VLOOKUP(D18,AllDocs!A:D,4,0)","v":"2018-07-17T00:00:20"},"Agreed",{"$f":"VLOOKUP(D18,AllDocs!A:F,6,0)","v":"CR"},"TS-0023 (WI-0084)",4]
[null,{"$f":"VLOOKUP(A19,logistics!G:I,2,0)","v":{"$error":"#N/A"}},{"$f":"VLOOKUP(A19,logistics!G:I,3,0)","v":{"$error":"#N/A"}},null,{"$f":"VLOOKUP(D19,AllDocs!A:D,2,0)","v":{"$error":"#N/A"}},{"$f":"VLOOKUP(D19,AllDocs!A:D,3,0)","v":{"$error":"#N/A"}},{"$f":"VLOOKUP(D19,AllDocs!A:D,4,0)","v":{"$error":"#N/A"}},null,{"$f":"VLOOKUP(D19,AllDocs!A:F,6,0)","v":{"$error":"#N/A"}}]
["Tue-4 (15:30-17:00)",{"$f":"VLOOKUP(A20,logistics!G:I,2,0)","v":1},{"$f":"VLOOKUP(A20,logistics!G:I,3,0)","v":"REQ/MAS"},"<semantics>",{"$f":"VLOOKUP(D20,AllDocs!A:D,2,0)","v":{"$error":"#N/A"}},{"$f":"VLOOKUP(D20,AllDocs!A:D,3,0)","v":{"$error":"#N/A"}},{"$f":"VLOOKUP(D20,AllDocs!A:D,4,0)","v":{"$error":"#N/A"}},null,{"$f":"VLOOKUP(D20,AllDocs!A:F,6,0)","v":{"$error":"#N/A"}}]
[null,{"$f":"VLOOKUP(A21,logistics!G:I,2,0)","v":{"$error":"#N/A"}},{"$f":"VLOOKUP(A21,logistics!G:I,3,0)","v":{"$error":"#N/A"}},"REQ-2018-0048",{"$f":"VLOOKUP(D21,AllDocs!A:D,2,0)","v":"use_case_for_automatic_ontology_mapping"},{"$f":"VLOOKUP(D21,AllDocs!A:D,3,0)","v":"CMCC,Huawei"},{"$f":"VLOOKUP(D21,AllDocs!A:D,4,0)","v":"2018-07-09T08:43:25"},null,{"$f":"VLOOKUP(D21,AllDocs!A:F,6,0)","v":"CR"}]
[null,{"$f":"VLOOKUP(A22,logistics!G:I,2,0)","v":{"$error":"#N/A"}},{"$f":"VLOOKUP(A22,logistics!G:I,3,0)","v":{"$error":"#N/A"}},"REQ-2018-0048R01",{"$f":"VLOOKUP(D22,AllDocs!A:D,2,0)","v":"use_case_for_automatic_ontology_mapping"},{"$f":"VLOOKUP(D22,AllDocs!A:D,3,0)","v":"CMCC,Huawei"},{"$f":"VLOOKUP(D22,AllDocs!A:D,4,0)","v":"2018-07-09T09:23:14"},null,{"$f":"VLOOKUP(D22,AllDocs!A:F,6,0)","v":"CR"}]
[null,{"$f":"VLOOKUP(A23,logistics!G:I,2,0)","v":{"$error":"#N/A"}},{"$f":"VLOOKUP(A23,logistics!G:I,3,0)","v":{"$error":"#N/A"}},"REQ-2018-0049",{"$f":"VLOOKUP(D23,AllDocs!A:D,2,0)","v":"use_case_for_ontology_mapping_conflict_detection"},{"$f":"VLOOKUP(D23,AllDocs!A:D,3,0)","v":"CMCC, Huawei"},{"$f":"VLOOKUP(D23,AllDocs!A:D,4,0)","v":"2018-07-09T09:08:19"},null,{"$f":"VLOOKUP(D23,AllDocs!A:F,6,0)","v":"CR"}]
[null,{"$f":"VLOOKUP(A24,logistics!G:I,2,0)","v":{"$error":"#N/A"}},{"$f":"VLOOKUP(A24,logistics!G:I,3,0)","v":{"$error":"#N/A"}},"REQ-2018-0050",{"$f":"VLOOKUP(D24,AllDocs!A:D,2,0)","v":"use_case_for_ontology_mapping_conflict_repair"},{"$f":"VLOOKUP(D24,AllDocs!A:D,3,0)","v":"CMCC, Huawei"},{"$f":"VLOOKUP(D24,AllDocs!A:D,4,0)","v":"2018-07-09T09:11:46"},null,{"$f":"VLOOKUP(D24,AllDocs!A:F,6,0)","v":"CR"}]
[null,{"$f":"VLOOKUP(A25,logistics!G:I,2,0)","v":{"$error":"#N/A"}},{"$f":"VLOOKUP(A25,logistics!G:I,3,0)","v":{"$error":"#N/A"}},"REQ-2018-0055",{"$f":"VLOOKUP(D25,AllDocs!A:D,2,0)","v":"use case for semantic query and discovery based on ontology mapping"},{"$f":"VLOOKUP(D25,AllDocs!A:D,3,0)","v":"Yongjing Zhang (Huawei), Yawen Niu (CMCC)"},{"$f":"VLOOKUP(D25,AllDocs!A:D,4,0)","v":"2018-07-09T11:12:35"},null,{"$f":"VLOOKUP(D25,AllDocs!A:F,6,0)","v":"CR"}]
[null,{"$f":"VLOOKUP(A26,logistics!G:I,2,0)","v":{"$error":"#N/A"}},{"$f":"VLOOKUP(A26,logistics!G:I,3,0)","v":{"$error":"#N/A"}},"REQ-2018-0056",{"$f":"VLOOKUP(D26,AllDocs!A:D,2,0)","v":"use case for semantic control based on ontology mapping."},{"$f":"VLOOKUP(D26,AllDocs!A:D,3,0)","v":"Yongjing Zhang (Huawei), Yawen Niu (CMCC)"},{"$f":"VLOOKUP(D26,AllDocs!A:D,4,0)","v":"2018-07-09T11:12:51"},null,{"$f":"VLOOKUP(D26,AllDocs!A:F,6,0)","v":"CR"}]
[null,{"$f":"VLOOKUP(A27,logistics!G:I,2,0)","v":{"$error":"#N/A"}},{"$f":"VLOOKUP(A27,logistics!G:I,3,0)","v":{"$error":"#N/A"}},"REQ-2018-0051",{"$f":"VLOOKUP(D27,AllDocs!A:D,2,0)","v":"Requirement_for_automatic_ontology_mapping_Use_case"},{"$f":"VLOOKUP(D27,AllDocs!A:D,3,0)","v":"CMCC, Huawei"},{"$f":"VLOOKUP(D27,AllDocs!A:D,4,0)","v":"2018-07-09T09:16:49"},null,{"$f":"VLOOKUP(D27,AllDocs!A:F,6,0)","v":"CR"}]
[null,{"$f":"VLOOKUP(A28,logistics!G:I,2,0)","v":{"$error":"#N/A"}},{"$f":"VLOOKUP(A28,logistics!G:I,3,0)","v":{"$error":"#N/A"}},"REQ-2018-0052",{"$f":"VLOOKUP(D28,AllDocs!A:D,2,0)","v":"Requirement_for_ ontology_mapping_conflict_detection _Use_case"},{"$f":"VLOOKUP(D28,AllDocs!A:D,3,0)","v":"CMCC, Huawei"},{"$f":"VLOOKUP(D28,AllDocs!A:D,4,0)","v":"2018-07-09T09:19:46"},null,{"$f":"VLOOKUP(D28,AllDocs!A:F,6,0)","v":"CR"}]
[null,{"$f":"VLOOKUP(A29,logistics!G:I,2,0)","v":{"$error":"#N/A"}},{"$f":"VLOOKUP(A29,logistics!G:I,3,0)","v":{"$error":"#N/A"}},"REQ-2018-0053",{"$f":"VLOOKUP(D29,AllDocs!A:D,2,0)","v":"Requirement_for_ ontology_mapping_conflict_repair _Use_case"},{"$f":"VLOOKUP(D29,AllDocs!A:D,3,0)","v":"CMCC, Huawei"},{"$f":"VLOOKUP(D29,AllDocs!A:D,4,0)","v":"2018-07-09T09:21:48"},null,{"$f":"VLOOKUP(D29,AllDocs!A:F,6,0)","v":"CR"}]
[null,{"$f":"VLOOKUP(A30,logistics!G:I,2,0)","v":{"$error":"#N/A"}},{"$f":"VLOOKUP(A30,logistics!G:I,3,0)","v":{"$error":"#N/A"}},"REQ-2018-0057",{"$f":"VLOOKUP(D30,AllDocs!A:D,2,0)","v":"TS-0002 Requirements for semantic query and discovery based on ontology mapping"},{"$f":"VLOOKUP(D30,AllDocs!A:D,3,0)","v":"Yongjing Zhang (Huawei), Yawen Niu (CMCC)"},{"$f":"VLOOKUP(D30,AllDocs!A:D,4,0)","v":"2018-07-09T11:13:02"},null,{"$f":"VLOOKUP(D30,AllDocs!A:F,6,0)","v":"CR"}]
[null,{"$f":"VLOOKUP(A31,logistics!G:I,2,0)","v":{"$error":"#N/A"}},{"$f":"VLOOKUP(A31,logistics!G:I,3,0)","v":{"$error":"#N/A"}},"REQ-2018-0058",{"$f":"VLOOKUP(D31,AllDocs!A:D,2,0)","v":"TS-0002 Requirements for semantic control based on ontology mapping"},{"$f":"VLOOKUP(D31,AllDocs!A:D,3,0)","v":"Yongjing Zhang (Huawei), Yawen Niu (CMCC)"},{"$f":"VLOOKUP(D31,AllDocs!A:D,4,0)","v":"2018-07-09T11:13:12"},null,{"$f":"VLOOKUP(D31,AllDocs!A:F,6,0)","v":"CR"}]
[null,{"$f":"VLOOKUP(A32,logistics!G:I,2,0)","v":{"$error":"#N/A"}},{"$f":"VLOOKUP(A32,logistics!G:I,3,0)","v":{"$error":"#N/A"}},null,{"$f":"VLOOKUP(D32,AllDocs!A:D,2,0)","v":{"$error":"#N/A"}},{"$f":"VLOOKUP(D32,AllDocs!A:D,3,0)","v":{"$error":"#N/A"}},{"$f":"VLOOKUP(D32,AllDocs!A:D,4,0)","v":{"$error":"#N/A"}},null,{"$f":"VLOOKUP(D32,AllDocs!A:F,6,0)","v":{"$error":"#N/A"}}]
[null,{"$f":"VLOOKUP(A33,logistics!G:I,2,0)","v":{"$error":"#N/A"}},{"$f":"VLOOKUP(A33,logistics!G:I,3,0)","v":{"$error":"#N/A"}},null,{"$f":"VLOOKUP(D33,AllDocs!A:D,2,0)","v":{"$error":"#N/A"}},{"$f":"VLOOKUP(D33,AllDocs!A:D,3,0)","v":{"$error":"#N/A"}},{"$f":"VLOOKUP(D33,AllDocs!A:D,4,0)","v":{"$error":"#N/A"}},null,{"$f":"VLOOKUP(D33,AllDocs!A:F,6,0)","v":{"$error":"#N/A"}}]
[null,{"$f":"VLOOKUP(A34,logistics!G:I,2,0)","v":{"$error":"#N/A"}},{"$f":"VLOOKUP(A34,logistics!G:I,3,0)","v":{"$error":"#N/A"}},null,{"$f":"VLOOKUP(D34,AllDocs!A:D,2,0)","v":{"$error":"#N/A"}},{"$f":"VLOOKUP(D34,AllDocs!A:D,3,0)","v":{"$error":"#N/A"}},{"$f":"VLOOKUP(D34,AllDocs!A:D,4,0)","v":{"$error":"#N/A"}},null,{"$f":"VLOOKUP(D34,AllDocs!A:F,6,0)","v":{"$error":"#N/A"}}]
["Wed-1 (08:30-10:00)",{"$f":"VLOOKUP(A35,logistics!G:I,2,0)","v":{"$error":"#N/A"}},{"$f":"VLOOKUP(A35,logistics!G:I,3,0)","v":{"$error":"#N/A"}},"<SDT4.0>",{"$f":"VLOOKUP(D35,AllDocs!A:D,2,0)","v":{"$error":"#N/A"}},{"$f":"VLOOKUP(D35,AllDocs!A:D,3,0)","v":{"$error":"#N/A"}},{"$f":"VLOOKUP(D35,AllDocs!A:D,4,0)","v":{"$error":"#N/A"}},null,{"$f":"VLOOKUP(D35,AllDocs!A:F,6,0)","v":{"$error":"#N/A"}}]
[null,{"$f":"VLOOKUP(A36,logistics!G:I,2,0)","v":{"$error":"#N/A"}},{"$f":"VLOOKUP(A36,logistics!G:I,3,0)","v":{"$error":"#N/A"}},"MAS-2018-0102",{"$f":"VLOOKUP(D36,AllDocs!A:D,2,0)","v":"Analysis of industrial domain information models"},{"$f":"VLOOKUP(D36,AllDocs!A:D,3,0)","v":"Hitachi"},{"$f":"VLOOKUP(D36,AllDocs!A:D,4,0)","v":"2018-07-09T10:06:41"},null,{"$f":"VLOOKUP(D36,AllDocs!A:F,6,0)","v":"INC"},"TR-0049 (WI-0075)"]
[null,{"$f":"VLOOKUP(A37,logistics!G:I,2,0)","v":{"$error":"#N/A"}},{"$f":"VLOOKUP(A37,logistics!G:I,3,0)","v":{"$error":"#N/A"}},"MAS-2018-0092",{"$f":"VLOOKUP(D37,AllDocs!A:D,2,0)","v":"Smart City model - water quality monitor"},{"$f":"VLOOKUP(D37,AllDocs!A:D,3,0)","v":"Yongjing Zhang (Huawei)"},{"$f":"VLOOKUP(D37,AllDocs!A:D,4,0)","v":"2018-07-09T11:01:27"},null,{"$f":"VLOOKUP(D37,AllDocs!A:F,6,0)","v":"CR"},"TS-0023 (WI-0084)",4]
[null,{"$f":"VLOOKUP(A38,logistics!G:I,2,0)","v":{"$error":"#N/A"}},{"$f":"VLOOKUP(A38,logistics!G:I,3,0)","v":{"$error":"#N/A"}},"MAS-2018-0091",{"$f":"VLOOKUP(D38,AllDocs!A:D,2,0)","v":"Smart City model - parking detector"},{"$f":"VLOOKUP(D38,AllDocs!A:D,3,0)","v":"Yongjing Zhang (Huawei)"},{"$f":"VLOOKUP(D38,AllDocs!A:D,4,0)","v":"2018-07-09T11:01:42"},null,{"$f":"VLOOKUP(D38,AllDocs!A:F,6,0)","v":"CR"},"TS-0023 (WI-0084)",4]
[null,{"$f":"VLOOKUP(A39,logistics!G:I,2,0)","v":{"$error":"#N/A"}},{"$f":"VLOOKUP(A39,logistics!G:I,3,0)","v":{"$error":"#N/A"}},"MAS-2018-0090",{"$f":"VLOOKUP(D39,AllDocs!A:D,2,0)","v":"Smart City model - water meter"},{"$f":"VLOOKUP(D39,AllDocs!A:D,3,0)","v":"Yongjing Zhang (Huawei)"},{"$f":"VLOOKUP(D39,AllDocs!A:D,4,0)","v":"2018-07-09T11:01:55"},null,{"$f":"VLOOKUP(D39,AllDocs!A:F,6,0)","v":"CR"},"TS-0023 (WI-0084)",4]
[null,{"$f":"VLOOKUP(A40,logistics!G:I,2,0)","v":{"$error":"#N/A"}},{"$f":"VLOOKUP(A40,logistics!G:I,3,0)","v":{"$error":"#N/A"}},"MAS-2018-0095",{"$f":"VLOOKUP(D40,AllDocs!A:D,2,0)","v":"Algorithm for short names for TS-0023"},{"$f":"VLOOKUP(D40,AllDocs!A:D,3,0)","v":"Andreas Kraft (Deutsche Telekom)"},{"$f":"VLOOKUP(D40,AllDocs!A:D,4,0)","v":"2018-07-06T10:52:46"},null,{"$f":"VLOOKUP(D40,AllDocs!A:F,6,0)","v":"CR"},"TS-0023 (WI-0084)",4]
[null,{"$f":"VLOOKUP(A41,logistics!G:I,2,0)","v":{"$error":"#N/A"}},{"$f":"VLOOKUP(A41,logistics!G:I,3,0)","v":{"$error":"#N/A"}},"MAS-2018-0098",{"$f":"VLOOKUP(D41,AllDocs!A:D,2,0)","v":"SDT_for_design_of_content_attribute"},{"$f":"VLOOKUP(D41,AllDocs!A:D,3,0)","v":"NTT"},{"$f":"VLOOKUP(D41,AllDocs!A:D,4,0)","v":"2018-07-09T06:53:38"},null,{"$f":"VLOOKUP(D41,AllDocs!A:F,6,0)","v":"CR"},"TS-0023 (WI-0084)",4]
[null,{"$f":"VLOOKUP(A42,logistics!G:I,2,0)","v":{"$error":"#N/A"}},{"$f":"VLOOKUP(A42,logistics!G:I,3,0)","v":{"$error":"#N/A"}},"MAS-2018-0098R01",{"$f":"VLOOKUP(D42,AllDocs!A:D,2,0)","v":"SDT_for_design_of_content_attribute"},{"$f":"VLOOKUP(D42,AllDocs!A:D,3,0)","v":"NTT"},{"$f":"VLOOKUP(D42,AllDocs!A:D,4,0)","v":"2018-07-12T08:13:14"},null,{"$f":"VLOOKUP(D42,AllDocs!A:F,6,0)","v":"CR"},"TS-0023 (WI-0084)",4]
[null,{"$f":"VLOOKUP(A43,logistics!G:I,2,0)","v":{"$error":"#N/A"}},{"$f":"VLOOKUP(A43,logistics!G:I,3,0)","v":{"$error":"#N/A"}},"MAS-2018-0099R01",{"$f":"VLOOKUP(D43,AllDocs!A:D,2,0)","v":"Adding_a_new_element_to_TS-0023"},{"$f":"VLOOKUP(D43,AllDocs!A:D,3,0)","v":"CMCC, Huawei"},{"$f":"VLOOKUP(D43,AllDocs!A:D,4,0)","v":"2018-07-09T09:31:27"},null,{"$f":"VLOOKUP(D43,AllDocs!A:F,6,0)","v":"CR"},"TS-0023 (WI-0084)",4]
[null,{"$f":"VLOOKUP(A44,logistics!G:I,2,0)","v":{"$error":"#N/A"}},{"$f":"VLOOKUP(A44,logistics!G:I,3,0)","v":{"$error":"#N/A"}},"MAS-2018-0100",{"$f":"VLOOKUP(D44,AllDocs!A:D,2,0)","v":"Adding_a_few_new_elements_for_DataPoints_of_refrigeration _ModuleClass"},{"$f":"VLOOKUP(D44,AllDocs!A:D,3,0)","v":"CMCC, Huawei"},{"$f":"VLOOKUP(D44,AllDocs!A:D,4,0)","v":"2018-07-09T09:33:43"},null,{"$f":"VLOOKUP(D44,AllDocs!A:F,6,0)","v":"CR"},"TS-0023 (WI-0084)",4]
[null,{"$f":"VLOOKUP(A45,logistics!G:I,2,0)","v":{"$error":"#N/A"}},{"$f":"VLOOKUP(A45,logistics!G:I,3,0)","v":{"$error":"#N/A"}},"MAS-2018-0101",{"$f":"VLOOKUP(D45,AllDocs!A:D,2,0)","v":"Adding_a_few_new_elements_for_Device_model"},{"$f":"VLOOKUP(D45,AllDocs!A:D,3,0)","v":"CMCC, Huawei"},{"$f":"VLOOKUP(D45,AllDocs!A:D,4,0)","v":"2018-07-09T09:36:57"},null,{"$f":"VLOOKUP(D45,AllDocs!A:F,6,0)","v":"CR"},"TS-0023 (WI-0084)",4]
[null,{"$f":"VLOOKUP(A46,logistics!G:I,2,0)","v":{"$error":"#N/A"}},{"$f":"VLOOKUP(A46,logistics!G:I,3,0)","v":{"$error":"#N/A"}},"MAS-2018-0081R01",{"$f":"VLOOKUP(D46,AllDocs!A:D,2,0)","v":"SDT4 change log"},{"$f":"VLOOKUP(D46,AllDocs!A:D,3,0)","v":"Yongjing Zhang (Huawei)"},{"$f":"VLOOKUP(D46,AllDocs!A:D,4,0)","v":"2018-07-03T09:41:51"},null,{"$f":"VLOOKUP(D46,AllDocs!A:F,6,0)","v":"CR"},"SDT4.0 (WI-0081)",4]
[null,{"$f":"VLOOKUP(A47,logistics!G:I,2,0)","v":{"$error":"#N/A"}},{"$f":"VLOOKUP(A47,logistics!G:I,3,0)","v":{"$error":"#N/A"}},"MAS-2018-0084",{"$f":"VLOOKUP(D47,AllDocs!A:D,2,0)","v":"SDT4 JSON"},{"$f":"VLOOKUP(D47,AllDocs!A:D,3,0)","v":"Yongjing Zhang (Huawei)"},{"$f":"VLOOKUP(D47,AllDocs!A:D,4,0)","v":"2018-07-04T03:36:11"},null,{"$f":"VLOOKUP(D47,AllDocs!A:F,6,0)","v":"CR"},"SDT4.0 (WI-0081)",4]
[null,{"$f":"VLOOKUP(A48,logistics!G:I,2,0)","v":{"$error":"#N/A"}},{"$f":"VLOOKUP(A48,logistics!G:I,3,0)","v":{"$error":"#N/A"}},"MAS-2018-0085",{"$f":"VLOOKUP(D48,AllDocs!A:D,2,0)","v":"SDT4 removing Module"},{"$f":"VLOOKUP(D48,AllDocs!A:D,3,0)","v":"Yongjing Zhang (Huawei)"},{"$f":"VLOOKUP(D48,AllDocs!A:D,4,0)","v":"2018-07-04T03:36:21"},null,{"$f":"VLOOKUP(D48,AllDocs!A:F,6,0)","v":"CR"},"SDT4.0 (WI-0081)",4]
[null,{"$f":"VLOOKUP(A49,logistics!G:I,2,0)","v":{"$error":"#N/A"}},{"$f":"VLOOKUP(A49,logistics!G:I,3,0)","v":{"$error":"#N/A"}},"MAS-2018-0082",{"$f":"VLOOKUP(D49,AllDocs!A:D,2,0)","v":"Introducing Product in SDT4"},{"$f":"VLOOKUP(D49,AllDocs!A:D,3,0)","v":"Yongjing Zhang (Huawei)"},{"$f":"VLOOKUP(D49,AllDocs!A:D,4,0)","v":"2018-07-04T03:36:34"},null,{"$f":"VLOOKUP(D49,AllDocs!A:F,6,0)","v":"CR"},"SDT4.0 (WI-0081)",4]
[null,{"$f":"VLOOKUP(A50,logistics!G:I,2,0)","v":{"$error":"#N/A"}},{"$f":"VLOOKUP(A50,logistics!G:I,3,0)","v":{"$error":"#N/A"}},"MAS-2018-0103",{"$f":"VLOOKUP(D50,AllDocs!A:D,2,0)","v":"SDT 4.0 鈥?Introducing Enumerations"},{"$f":"VLOOKUP(D50,AllDocs!A:D,3,0)","v":"Andreas Kraft (Deutsche Telekom)"},{"$f":"VLOOKUP(D50,AllDocs!A:D,4,0)","v":"2018-07-10T13:09:53"},null,{"$f":"VLOOKUP(D50,AllDocs!A:F,6,0)","v":"CR"},"SDT4.0 (WI-0081)",4]
[null,{"$f":"VLOOKUP(A51,logistics!G:I,2,0)","v":{"$error":"#N/A"}},{"$f":"VLOOKUP(A51,logistics!G:I,3,0)","v":{"$error":"#N/A"}},"MAS-2018-0104",{"$f":"VLOOKUP(D51,AllDocs!A:D,2,0)","v":"SDT 4.0 鈥?Introducing Referenced DataTypes"},{"$f":"VLOOKUP(D51,AllDocs!A:D,3,0)","v":"Andreas Kraft (Deutsche Telekom)"},{"$f":"VLOOKUP(D51,AllDocs!A:D,4,0)","v":"2018-07-10T13:10:48"},null,{"$f":"VLOOKUP(D51,AllDocs!A:F,6,0)","v":"CR"},"SDT4.0 (WI-0081)",4]
[null,{"$f":"VLOOKUP(A52,logistics!G:I,2,0)","v":{"$error":"#N/A"}},{"$f":"VLOOKUP(A52,logistics!G:I,3,0)","v":{"$error":"#N/A"}},"MAS-2018-0083",{"$f":"VLOOKUP(D52,AllDocs!A:D,2,0)","v":"SDT4 DeviceClass"},{"$f":"VLOOKUP(D52,AllDocs!A:D,3,0)","v":"Yongjing Zhang (Huawei)"},{"$f":"VLOOKUP(D52,AllDocs!A:D,4,0)","v":"00:00:00"},"Postponed",{"$f":"VLOOKUP(D52,AllDocs!A:F,6,0)","v":"CR"},"SDT4.0 (WI-0081)",4,null,"Postponed to future meeting."]
[null,{"$f":"VLOOKUP(A53,logistics!G:I,2,0)","v":{"$error":"#N/A"}},{"$f":"VLOOKUP(A53,logistics!G:I,3,0)","v":{"$error":"#N/A"}},null,{"$f":"VLOOKUP(D53,AllDocs!A:D,2,0)","v":{"$error":"#N/A"}},{"$f":"VLOOKUP(D53,AllDocs!A:D,3,0)","v":{"$error":"#N/A"}},{"$f":"VLOOKUP(D53,AllDocs!A:D,4,0)","v":{"$error":"#N/A"}},null,{"$f":"VLOOKUP(D53,AllDocs!A:F,6,0)","v":{"$error":"#N/A"}}]
[null,{"$f":"VLOOKUP(A54,logistics!G:I,2,0)","v":{"$error":"#N/A"}},{"$f":"VLOOKUP(A54,logistics!G:I,3,0)","v":{"$error":"#N/A"}},null,{"$f":"VLOOKUP(D54,AllDocs!A:D,2,0)","v":{"$error":"#N/A"}},{"$f":"VLOOKUP(D54,AllDocs!A:D,3,0)","v":{"$error":"#N/A"}},{"$f":"VLOOKUP(D54,AllDocs!A:D,4,0)","v":{"$error":"#N/A"}},null,{"$f":"VLOOKUP(D54,AllDocs!A:F,6,0)","v":{"$error":"#N/A"}}]
[null,{"$f":"VLOOKUP(A55,logistics!G:I,2,0)","v":{"$error":"#N/A"}},{"$f":"VLOOKUP(A55,logistics!G:I,3,0)","v":{"$error":"#N/A"}},null,{"$f":"VLOOKUP(D55,AllDocs!A:D,2,0)","v":{"$error":"#N/A"}},{"$f":"VLOOKUP(D55,AllDocs!A:D,3,0)","v":{"$error":"#N/A"}},{"$f":"VLOOKUP(D55,AllDocs!A:D,4,0)","v":{"$error":"#N/A"}},null,{"$f":"VLOOKUP(D55,AllDocs!A:F,6,0)","v":{"$error":"#N/A"}}]
[null,{"$f":"VLOOKUP(A56,logistics!G:I,2,0)","v":{"$error":"#N/A"}},{"$f":"VLOOKUP(A56,logistics!G:I,3,0)","v":{"$error":"#N/A"}},null,{"$f":"VLOOKUP(D56,AllDocs!A:D,2,0)","v":{"$error":"#N/A"}},{"$f":"VLOOKUP(D56,AllDocs!A:D,3,0)","v":{"$error":"#N/A"}},{"$f":"VLOOKUP(D56,AllDocs!A:D,4,0)","v":{"$error":"#N/A"}},null,{"$f":"VLOOKUP(D56,AllDocs!A:F,6,0)","v":{"$error":"#N/A"}}]
[null,{"$f":"VLOOKUP(A57,logistics!G:I,2,0)","v":{"$error":"#N/A"}},{"$f":"VLOOKUP(A57,logistics!G:I,3,0)","v":{"$error":"#N/A"}},null,{"$f":"VLOOKUP(D57,AllDocs!A:D,2,0)","v":{"$error":"#N/A"}},{"$f":"VLOOKUP(D57,AllDocs!A:D,3,0)","v":{"$error":"#N/A"}},{"$f":"VLOOKUP(D57,AllDocs!A:D,4,0)","v":{"$error":"#N/A"}},null,{"$f":"VLOOKUP(D57,AllDocs!A:F,6,0)","v":{"$error":"#N/A"}}]
["Wed-2 (11:00-12:30)",{"$f":"VLOOKUP(A58,logistics!G:I,2,0)","v":2},{"$f":"VLOOKUP(A58,logistics!G:I,3,0)","v":"MAS"},"<remainings>",{"$f":"VLOOKUP(D58,AllDocs!A:D,2,0)","v":{"$error":"#N/A"}},{"$f":"VLOOKUP(D58,AllDocs!A:D,3,0)","v":{"$error":"#N/A"}},{"$f":"VLOOKUP(D58,AllDocs!A:D,4,0)","v":{"$error":"#N/A"}},null,{"$f":"VLOOKUP(D58,AllDocs!A:F,6,0)","v":{"$error":"#N/A"}}]
[null,{"$f":"VLOOKUP(A59,logistics!G:I,2,0)","v":{"$error":"#N/A"}},{"$f":"VLOOKUP(A59,logistics!G:I,3,0)","v":{"$error":"#N/A"}},null,{"$f":"VLOOKUP(D59,AllDocs!A:D,2,0)","v":{"$error":"#N/A"}},{"$f":"VLOOKUP(D59,AllDocs!A:D,3,0)","v":{"$error":"#N/A"}},{"$f":"VLOOKUP(D59,AllDocs!A:D,4,0)","v":{"$error":"#N/A"}},null,{"$f":"VLOOKUP(D59,AllDocs!A:F,6,0)","v":{"$error":"#N/A"}}]
[null,{"$f":"VLOOKUP(A60,logistics!G:I,2,0)","v":{"$error":"#N/A"}},{"$f":"VLOOKUP(A60,logistics!G:I,3,0)","v":{"$error":"#N/A"}},"MAS-2018-0105R01",{"$f":"VLOOKUP(D60,AllDocs!A:D,2,0)","v":{"$error":"#N/A"}},{"$f":"VLOOKUP(D60,AllDocs!A:D,3,0)","v":{"$error":"#N/A"}},{"$f":"VLOOKUP(D60,AllDocs!A:D,4,0)","v":{"$error":"#N/A"}},null,{"$f":"VLOOKUP(D60,AllDocs!A:F,6,0)","v":{"$error":"#N/A"}},"TS-0023 (WI-0084)",4]
[null,{"$f":"VLOOKUP(A61,logistics!G:I,2,0)","v":{"$error":"#N/A"}},{"$f":"VLOOKUP(A61,logistics!G:I,3,0)","v":{"$error":"#N/A"}},"MAS-2018-0075R01",{"$f":"VLOOKUP(D61,AllDocs!A:D,2,0)","v":{"$error":"#N/A"}},{"$f":"VLOOKUP(D61,AllDocs!A:D,3,0)","v":{"$error":"#N/A"}},{"$f":"VLOOKUP(D61,AllDocs!A:D,4,0)","v":{"$error":"#N/A"}},null,{"$f":"VLOOKUP(D61,AllDocs!A:F,6,0)","v":{"$error":"#N/A"}},"TS-0023 (WI-0084)",4]
[null,{"$f":"VLOOKUP(A62,logistics!G:I,2,0)","v":{"$error":"#N/A"}},{"$f":"VLOOKUP(A62,logistics!G:I,3,0)","v":{"$error":"#N/A"}},"MAS-2018-0075R02",{"$f":"VLOOKUP(D62,AllDocs!A:D,2,0)","v":{"$error":"#N/A"}},{"$f":"VLOOKUP(D62,AllDocs!A:D,3,0)","v":{"$error":"#N/A"}},{"$f":"VLOOKUP(D62,AllDocs!A:D,4,0)","v":{"$error":"#N/A"}},null,{"$f":"VLOOKUP(D62,AllDocs!A:F,6,0)","v":{"$error":"#N/A"}},"TS-0023 (WI-0084)",4]
[null,{"$f":"VLOOKUP(A63,logistics!G:I,2,0)","v":{"$error":"#N/A"}},{"$f":"VLOOKUP(A63,logistics!G:I,3,0)","v":{"$error":"#N/A"}},"MAS-2018-0107",{"$f":"VLOOKUP(D63,AllDocs!A:D,2,0)","v":"Assingments of particular Devices to specific domains"},{"$f":"VLOOKUP(D63,AllDocs!A:D,3,0)","v":"Orange"},{"$f":"VLOOKUP(D63,AllDocs!A:D,4,0)","v":"2018-07-13T11:12:42"},null,{"$f":"VLOOKUP(D63,AllDocs!A:F,6,0)","v":"CR"},"TS-0023 (WI-0084)",4]
[null,{"$f":"VLOOKUP(A64,logistics!G:I,2,0)","v":{"$error":"#N/A"}},{"$f":"VLOOKUP(A64,logistics!G:I,3,0)","v":{"$error":"#N/A"}},"MAS-2018-0108",{"$f":"VLOOKUP(D64,AllDocs!A:D,2,0)","v":"TR-0046-V0_1_0 New baseline"},{"$f":"VLOOKUP(D64,AllDocs!A:D,3,0)","v":"SyncTechno, KETI"},{"$f":"VLOOKUP(D64,AllDocs!A:D,4,0)","v":"2018-07-15T23:50:14"},null,{"$f":"VLOOKUP(D64,AllDocs!A:F,6,0)","v":"INC"},"TR-0046 (WI-0070)",4]
[null,{"$f":"VLOOKUP(A65,logistics!G:I,2,0)","v":{"$error":"#N/A"}},{"$f":"VLOOKUP(A65,logistics!G:I,3,0)","v":{"$error":"#N/A"}},"MAS-2018-0109",{"$f":"VLOOKUP(D65,AllDocs!A:D,2,0)","v":"Abstract_information_models_for_public_warning_services"},{"$f":"VLOOKUP(D65,AllDocs!A:D,3,0)","v":"SyncTechno, KETI"},{"$f":"VLOOKUP(D65,AllDocs!A:D,4,0)","v":"2018-07-15T23:53:53"},null,{"$f":"VLOOKUP(D65,AllDocs!A:F,6,0)","v":"INC"},"TR-0046 (WI-0070)",4]
[null,{"$f":"VLOOKUP(A66,logistics!G:I,2,0)","v":{"$error":"#N/A"}},{"$f":"VLOOKUP(A66,logistics!G:I,3,0)","v":{"$error":"#N/A"}},"MAS-2018-0106",{"$f":"VLOOKUP(D66,AllDocs!A:D,2,0)","v":"Add wifiClient management object to TS-0022"},{"$f":"VLOOKUP(D66,AllDocs!A:D,3,0)","v":"Orange"},{"$f":"VLOOKUP(D66,AllDocs!A:D,4,0)","v":"2018-07-13T10:36:38"},null,{"$f":"VLOOKUP(D66,AllDocs!A:F,6,0)","v":"CR"},"TS-0022 (WI-0030)",4]
[null,{"$f":"VLOOKUP(A67,logistics!G:I,2,0)","v":{"$error":"#N/A"}},{"$f":"VLOOKUP(A67,logistics!G:I,3,0)","v":{"$error":"#N/A"}},"MAS-2018-0096R01",{"$f":"VLOOKUP(D67,AllDocs!A:D,2,0)","v":{"$error":"#N/A"}},{"$f":"VLOOKUP(D67,AllDocs!A:D,3,0)","v":{"$error":"#N/A"}},{"$f":"VLOOKUP(D67,AllDocs!A:D,4,0)","v":{"$error":"#N/A"}},null,{"$f":"VLOOKUP(D67,AllDocs!A:F,6,0)","v":{"$error":"#N/A"}},"TR-0033 (WI-0053)",4]
[null,{"$f":"VLOOKUP(A68,logistics!G:I,2,0)","v":{"$error":"#N/A"}},{"$f":"VLOOKUP(A68,logistics!G:I,3,0)","v":{"$error":"#N/A"}},null,{"$f":"VLOOKUP(D68,AllDocs!A:D,2,0)","v":{"$error":"#N/A"}},{"$f":"VLOOKUP(D68,AllDocs!A:D,3,0)","v":{"$error":"#N/A"}},{"$f":"VLOOKUP(D68,AllDocs!A:D,4,0)","v":{"$error":"#N/A"}},null,{"$f":"VLOOKUP(D68,AllDocs!A:F,6,0)","v":{"$error":"#N/A"}}]
[null,{"$f":"VLOOKUP(A69,logistics!G:I,2,0)","v":{"$error":"#N/A"}},{"$f":"VLOOKUP(A69,logistics!G:I,3,0)","v":{"$error":"#N/A"}},null,{"$f":"VLOOKUP(D69,AllDocs!A:D,2,0)","v":{"$error":"#N/A"}},{"$f":"VLOOKUP(D69,AllDocs!A:D,3,0)","v":{"$error":"#N/A"}},{"$f":"VLOOKUP(D69,AllDocs!A:D,4,0)","v":{"$error":"#N/A"}},null,{"$f":"VLOOKUP(D69,AllDocs!A:F,6,0)","v":{"$error":"#N/A"}}]
[null,{"$f":"VLOOKUP(A70,logistics!G:I,2,0)","v":{"$error":"#N/A"}},{"$f":"VLOOKUP(A70,logistics!G:I,3,0)","v":{"$error":"#N/A"}},null,{"$f":"VLOOKUP(D70,AllDocs!A:D,2,0)","v":{"$error":"#N/A"}},{"$f":"VLOOKUP(D70,AllDocs!A:D,3,0)","v":{"$error":"#N/A"}},{"$f":"VLOOKUP(D70,AllDocs!A:D,4,0)","v":{"$error":"#N/A"}},null,{"$f":"VLOOKUP(D70,AllDocs!A:F,6,0)","v":{"$error":"#N/A"}}]
[null,{"$f":"VLOOKUP(A71,logistics!G:I,2,0)","v":{"$error":"#N/A"}},{"$f":"VLOOKUP(A71,logistics!G:I,3,0)","v":{"$error":"#N/A"}},null,{"$f":"VLOOKUP(D71,AllDocs!A:D,2,0)","v":{"$error":"#N/A"}},{"$f":"VLOOKUP(D71,AllDocs!A:D,3,0)","v":{"$error":"#N/A"}},{"$f":"VLOOKUP(D71,AllDocs!A:D,4,0)","v":{"$error":"#N/A"}},null,{"$f":"VLOOKUP(D71,AllDocs!A:F,6,0)","v":{"$error":"#N/A"}}]
["Wed-3 (13:30-15:00)",{"$f":"VLOOKUP(A72,logistics!G:I,2,0)","v":1},{"$f":"VLOOKUP(A72,logistics!G:I,3,0)","v":"ARC/MAS"},"<TBD>",{"$f":"VLOOKUP(D72,AllDocs!A:D,2,0)","v":{"$error":"#N/A"}},{"$f":"VLOOKUP(D72,AllDocs!A:D,3,0)","v":{"$error":"#N/A"}},{"$f":"VLOOKUP(D72,AllDocs!A:D,4,0)","v":{"$error":"#N/A"}},null,{"$f":"VLOOKUP(D72,AllDocs!A:F,6,0)","v":{"$error":"#N/A"}}]
[null,{"$f":"VLOOKUP(A73,logistics!G:I,2,0)","v":{"$error":"#N/A"}},{"$f":"VLOOKUP(A73,logistics!G:I,3,0)","v":{"$error":"#N/A"}},"MAS-2018-0110",{"$f":"VLOOKUP(D73,AllDocs!A:D,2,0)","v":"HAIM_Data_Model_issues"},{"$f":"VLOOKUP(D73,AllDocs!A:D,3,0)","v":"Convida"},{"$f":"VLOOKUP(D73,AllDocs!A:D,4,0)","v":"2018-07-16T12:46:01"},null,{"$f":"VLOOKUP(D73,AllDocs!A:F,6,0)","v":"INC"},"TS-0023 (WI-0084)",4]
[null,{"$f":"VLOOKUP(A74,logistics!G:I,2,0)","v":{"$error":"#N/A"}},{"$f":"VLOOKUP(A74,logistics!G:I,3,0)","v":{"$error":"#N/A"}},null,{"$f":"VLOOKUP(D74,AllDocs!A:D,2,0)","v":{"$error":"#N/A"}},{"$f":"VLOOKUP(D74,AllDocs!A:D,3,0)","v":{"$error":"#N/A"}},{"$f":"VLOOKUP(D74,AllDocs!A:D,4,0)","v":{"$error":"#N/A"}},null,{"$f":"VLOOKUP(D74,AllDocs!A:F,6,0)","v":{"$error":"#N/A"}}]
[null,{"$f":"VLOOKUP(A75,logistics!G:I,2,0)","v":{"$error":"#N/A"}},{"$f":"VLOOKUP(A75,logistics!G:I,3,0)","v":{"$error":"#N/A"}},null,{"$f":"VLOOKUP(D75,AllDocs!A:D,2,0)","v":{"$error":"#N/A"}},{"$f":"VLOOKUP(D75,AllDocs!A:D,3,0)","v":{"$error":"#N/A"}},{"$f":"VLOOKUP(D75,AllDocs!A:D,4,0)","v":{"$error":"#N/A"}},null,{"$f":"VLOOKUP(D75,AllDocs!A:F,6,0)","v":{"$error":"#N/A"}}]
["Wed-4 (15:30-17:00)",{"$f":"VLOOKUP(A76,logistics!G:I,2,0)","v":2},{"$f":"VLOOKUP(A76,logistics!G:I,3,0)","v":"REQ/MAS"},"<semantics>",{"$f":"VLOOKUP(D76,AllDocs!A:D,2,0)","v":{"$error":"#N/A"}},{"$f":"VLOOKUP(D76,AllDocs!A:D,3,0)","v":{"$error":"#N/A"}},{"$f":"VLOOKUP(D76,AllDocs!A:D,4,0)","v":{"$error":"#N/A"}},null,{"$f":"VLOOKUP(D76,AllDocs!A:F,6,0)","v":{"$error":"#N/A"}}]
[null,{"$f":"VLOOKUP(A77,logistics!G:I,2,0)","v":{"$error":"#N/A"}},{"$f":"VLOOKUP(A77,logistics!G:I,3,0)","v":{"$error":"#N/A"}},null,{"$f":"VLOOKUP(D77,AllDocs!A:D,2,0)","v":{"$error":"#N/A"}},{"$f":"VLOOKUP(D77,AllDocs!A:D,3,0)","v":{"$error":"#N/A"}},{"$f":"VLOOKUP(D77,AllDocs!A:D,4,0)","v":{"$error":"#N/A"}},null,{"$f":"VLOOKUP(D77,AllDocs!A:F,6,0)","v":{"$error":"#N/A"}}]
[null,{"$f":"VLOOKUP(A78,logistics!G:I,2,0)","v":{"$error":"#N/A"}},{"$f":"VLOOKUP(A78,logistics!G:I,3,0)","v":{"$error":"#N/A"}},null,{"$f":"VLOOKUP(D78,AllDocs!A:D,2,0)","v":{"$error":"#N/A"}},{"$f":"VLOOKUP(D78,AllDocs!A:D,3,0)","v":{"$error":"#N/A"}},{"$f":"VLOOKUP(D78,AllDocs!A:D,4,0)","v":{"$error":"#N/A"}},null,{"$f":"VLOOKUP(D78,AllDocs!A:F,6,0)","v":{"$error":"#N/A"}}]
[null,{"$f":"VLOOKUP(A79,logistics!G:I,2,0)","v":{"$error":"#N/A"}},{"$f":"VLOOKUP(A79,logistics!G:I,3,0)","v":{"$error":"#N/A"}},null,{"$f":"VLOOKUP(D79,AllDocs!A:D,2,0)","v":{"$error":"#N/A"}},{"$f":"VLOOKUP(D79,AllDocs!A:D,3,0)","v":{"$error":"#N/A"}},{"$f":"VLOOKUP(D79,AllDocs!A:D,4,0)","v":{"$error":"#N/A"}},null,{"$f":"VLOOKUP(D79,AllDocs!A:F,6,0)","v":{"$error":"#N/A"}}]
["Thu-1 (9:00-10:30)",{"$f":"VLOOKUP(A80,logistics!G:I,2,0)","v":2},{"$f":"VLOOKUP(A80,logistics!G:I,3,0)","v":"REQ/MAS"},"<semantics>",{"$f":"VLOOKUP(D80,AllDocs!A:D,2,0)","v":{"$error":"#N/A"}},{"$f":"VLOOKUP(D80,AllDocs!A:D,3,0)","v":{"$error":"#N/A"}},{"$f":"VLOOKUP(D80,AllDocs!A:D,4,0)","v":{"$error":"#N/A"}},null,{"$f":"VLOOKUP(D80,AllDocs!A:F,6,0)","v":{"$error":"#N/A"}}]
[null,{"$f":"VLOOKUP(A81,logistics!G:I,2,0)","v":{"$error":"#N/A"}},{"$f":"VLOOKUP(A81,logistics!G:I,3,0)","v":{"$error":"#N/A"}},null,{"$f":"VLOOKUP(D81,AllDocs!A:D,2,0)","v":{"$error":"#N/A"}},{"$f":"VLOOKUP(D81,AllDocs!A:D,3,0)","v":{"$error":"#N/A"}},{"$f":"VLOOKUP(D81,AllDocs!A:D,4,0)","v":{"$error":"#N/A"}},null,{"$f":"VLOOKUP(D81,AllDocs!A:F,6,0)","v":{"$error":"#N/A"}}]
[null,{"$f":"VLOOKUP(A82,logistics!G:I,2,0)","v":{"$error":"#N/A"}},{"$f":"VLOOKUP(A82,logistics!G:I,3,0)","v":{"$error":"#N/A"}},null,{"$f":"VLOOKUP(D82,AllDocs!A:D,2,0)","v":{"$error":"#N/A"}},{"$f":"VLOOKUP(D82,AllDocs!A:D,3,0)","v":{"$error":"#N/A"}},{"$f":"VLOOKUP(D82,AllDocs!A:D,4,0)","v":{"$error":"#N/A"}},null,{"$f":"VLOOKUP(D82,AllDocs!A:F,6,0)","v":{"$error":"#N/A"}}]
[null,{"$f":"VLOOKUP(A83,logistics!G:I,2,0)","v":{"$error":"#N/A"}},{"$f":"VLOOKUP(A83,logistics!G:I,3,0)","v":{"$error":"#N/A"}},null,{"$f":"VLOOKUP(D83,AllDocs!A:D,2,0)","v":{"$error":"#N/A"}},{"$f":"VLOOKUP(D83,AllDocs!A:D,3,0)","v":{"$error":"#N/A"}},{"$f":"VLOOKUP(D83,AllDocs!A:D,4,0)","v":{"$error":"#N/A"}},null,{"$f":"VLOOKUP(D83,AllDocs!A:F,6,0)","v":{"$error":"#N/A"}}]
["Thu-4 (15:30-17:00)",{"$f":"VLOOKUP(A84,logistics!G:I,2,0)","v":2},{"$f":"VLOOKUP(A84,logistics!G:I,3,0)","v":"MAS"},"<CLOSING>",{"$f":"VLOOKUP(D84,AllDocs!A:D,2,0)","v":{"$error":"#N/A"}},{"$f":"VLOOKUP(D84,AllDocs!A:D,3,0)","v":{"$error":"#N/A"}},{"$f":"VLOOKUP(D84,AllDocs!A:D,4,0)","v":{"$error":"#N/A"}},null,{"$f":"VLOOKUP(D84,AllDocs!A:F,6,0)","v":{"$error":"#N/A"}}]
[null,{"$f":"VLOOKUP(A85,logistics!G:I,2,0)","v":{"$error":"#N/A"}},{"$f":"VLOOKUP(A85,logistics!G:I,3,0)","v":{"$error":"#N/A"}},null,{"$f":"VLOOKUP(D85,AllDocs!A:D,2,0)","v":{"$error":"#N/A"}},{"$f":"VLOOKUP(D85,AllDocs!A:D,3,0)","v":{"$error":"#N/A"}},{"$f":"VLOOKUP(D85,AllDocs!A:D,4,0)","v":{"$error":"#N/A"}},null,{"$f":"VLOOKUP(D85,AllDocs!A:F,6,0)","v":{"$error":"#N/A"}}]
[null,{"$f":"VLOOKUP(A86,logistics!G:I,2,0)","v":{"$error":"#N/A"}},{"$f":"VLOOKUP(A86,logistics!G:I,3,0)","v":{"$error":"#N/A"}},null,{"$f":"VLOOKUP(D86,AllDocs!A:D,2,0)","v":{"$error":"#N/A"}},{"$f":"VLOOKUP(D86,AllDocs!A:D,3,0)","v":{"$error":"#N/A"}},{"$f":"VLOOKUP(D86,AllDocs!A:D,4,0)","v":{"$error":"#N/A"}},null,{"$f":"VLOOKUP(D86,AllDocs!A:F,6,0)","v":{"$error":"#N/A"}}]
[null,{"$f":"VLOOKUP(A87,logistics!G:I,2,0)","v":{"$error":"#N/A"}},{"$f":"VLOOKUP(A87,logistics!G:I,3,0)","v":{"$error":"#N/A"}},null,{"$f":"VLOOKUP(D87,AllDocs!A:D,2,0)","v":{"$error":"#N/A"}},{"$f":"VLOOKUP(D87,AllDocs!A:D,3,0)","v":{"$error":"#N/A"}},{"$f":"VLOOKUP(D87,AllDocs!A:D,4,0)","v":{"$error":"#N/A"}},null,{"$f":"VLOOKUP(D87,AllDocs!A:F,6,0)","v":{"$error":"#N/A"}}]
[null,{"$f":"VLOOKUP(A88,logistics!G:I,2,0)","v":{"$error":"#N/A"}},{"$f":"VLOOKUP(A88,logistics!G:I,3,0)","v":{"$error":"#N/A"}},null,{"$f":"VLOOKUP(D88,AllDocs!A:D,2,0)","v":{"$error":"#N/A"}},{"$f":"VLOOKUP(D88,AllDocs!A:D,3,0)","v":{"$error":"#N/A"}},{"$f":"VLOOKUP(D88,AllDocs!A:D,4,0)","v":{"$error":"#N/A"}},null,{"$f":"VLOOKUP(D88,AllDocs!A:F,6,0)","v":{"$error":"#N/A"}}]
[null,{"$f":"VLOOKUP(A89,logistics!G:I,2,0)","v":{"$error":"#N/A"}},{"$f":"VLOOKUP(A89,logistics!G:I,3,0)","v":{"$error":"#N/A"}},null,{"$f":"VLOOKUP(D89,AllDocs!A:D,2,0)","v":{"$error":"#N/A"}},{"$f":"VLOOKUP(D89,AllDocs!A:D,3,0)","v":{"$error":"#N/A"}},{"$f":"VLOOKUP(D89,AllDocs!A:D,4,0)","v":{"$error":"#N/A"}},null,{"$f":"VLOOKUP(D89,AllDocs!A:F,6,0)","v":{"$error":"#N/A"}}]
[null,{"$f":"VLOOKUP(A90,logistics!G:I,2,0)","v":{"$error":"#N/A"}},{"$f":"VLOOKUP(A90,logistics!G:I,3,0)","v":{"$error":"#N/A"}},null,{"$f":"VLOOKUP(D90,AllDocs!A:D,2,0)","v":{"$error":"#N/A"}},{"$f":"VLOOKUP(D90,AllDocs!A:D,3,0)","v":{"$error":"#N/A"}},{"$f":"VLOOKUP(D90,AllDocs!A:D,4,0)","v":{"$error":"#N/A"}},null,{"$f":"VLOOKUP(D90,AllDocs!A:F,6,0)","v":{"$error":"#N/A"}}]
[null,{"$f":"VLOOKUP(A91,logistics!G:I,2,0)","v":{"$error":"#N/A"}},{"$f":"VLOOKUP(A91,logistics!G:I,3,0)","v":{"$error":"#N/A"}},null,{"$f":"VLOOKUP(D91,AllDocs!A:D,2,0)","v":{"$error":"#N/A"}},{"$f":"VLOOKUP(D91,AllDocs!A:D,3,0)","v":{"$error":"#N/A"}},{"$f":"VLOOKUP(D91,AllDocs!A:D,4,0)","v":{"$error":"#N/A"}},null,{"$f":"VLOOKUP(D91,AllDocs!A:F,6,0)","v":{"$error":"#N/A"}}]
[null,{"$f":"VLOOKUP(A92,logistics!G:I,2,0)","v":{"$error":"#N/A"}},{"$f":"VLOOKUP(A92,logistics!G:I,3,0)","v":{"$error":"#N/A"}},null,{"$f":"VLOOKUP(D92,AllDocs!A:D,2,0)","v":{"$error":"#N/A"}},{"$f":"VLOOKUP(D92,AllDocs!A:D,3,0)","v":{"$error":"#N/A"}},{"$f":"VLOOKUP(D92,AllDocs!A:D,4,0)","v":{"$error":"#N/A"}},null,{"$f":"VLOOKUP(D92,AllDocs!A:F,6,0)","v":{"$error":"#N/A"}}]
[null,{"$f":"VLOOKUP(A93,logistics!G:I,2,0)","v":{"$error":"#N/A"}},{"$f":"VLOOKUP(A93,logistics!G:I,3,0)","v":{"$error":"#N/A"}},null,{"$f":"VLOOKUP(D93,AllDocs!A:D,2,0)","v":{"$error":"#N/A"}},{"$f":"VLOOKUP(D93,AllDocs!A:D,3,0)","v":{"$error":"#N/A"}},{"$f":"VLOOKUP(D93,AllDocs!A:D,4,0)","v":{"$error":"#N/A"}},null,{"$f":"VLOOKUP(D93,AllDocs!A:F,6,0)","v":{"$error":"#N/A"}}]
[null,{"$f":"VLOOKUP(A94,logistics!G:I,2,0)","v":{"$error":"#N/A"}},{"$f":"VLOOKUP(A94,logistics!G:I,3,0)","v":{"$error":"#N/A"}},null,{"$f":"VLOOKUP(D94,AllDocs!A:D,2,0)","v":{"$error":"#N/A"}},{"$f":"VLOOKUP(D94,AllDocs!A:D,3,0)","v":{"$error":"#N/A"}},{"$f":"VLOOKUP(D94,AllDocs!A:D,4,0)","v":{"$error":"#N/A"}},null,{"$f":"VLOOKUP(D94,AllDocs!A:F,6,0)","v":{"$error":"#N/A"}}]
[null,{"$f":"VLOOKUP(A95,logistics!G:I,2,0)","v":{"$error":"#N/A"}},{"$f":"VLOOKUP(A95,logistics!G:I,3,0)","v":{"$error":"#N/A"}},null,{"$f":"VLOOKUP(D95,AllDocs!A:D,2,0)","v":{"$error":"#N/A"}},{"$f":"VLOOKUP(D95,AllDocs!A:D,3,0)","v":{"$error":"#N/A"}},{"$f":"VLOOKUP(D95,AllDocs!A:D,4,0)","v":{"$error":"#N/A"}},null,{"$f":"VLOOKUP(D95,AllDocs!A:F,6,0)","v":{"$error":"#N/A"}}]
[null,{"$f":"VLOOKUP(A96,logistics!G:I,2,0)","v":{"$error":"#N/A"}},{"$f":"VLOOKUP(A96,logistics!G:I,3,0)","v":{"$error":"#N/A"}},null,{"$f":"VLOOKUP(D96,AllDocs!A:D,2,0)","v":{"$error":"#N/A"}},{"$f":"VLOOKUP(D96,AllDocs!A:D,3,0)","v":{"$error":"#N/A"}},{"$f":"VLOOKUP(D96,AllDocs!A:D,4,0)","v":{"$error":"#N/A"}},null,{"$f":"VLOOKUP(D96,AllDocs!A:F,6,0)","v":{"$error":"#N/A"}}]
[null,{"$f":"VLOOKUP(A97,logistics!G:I,2,0)","v":{"$error":"#N/A"}},{"$f":"VLOOKUP(A97,logistics!G:I,3,0)","v":{"$error":"#N/A"}},null,{"$f":"VLOOKUP(D97,AllDocs!A:D,2,0)","v":{"$error":"#N/A"}},{"$f":"VLOOKUP(D97,AllDocs!A:D,3,0)","v":{"$error":"#N/A"}},{"$f":"VLOOKUP(D97,AllDocs!A:D,4,0)","v":{"$error":"#N/A"}},null,{"$f":"VLOOKUP(D97,AllDocs!A:F,6,0)","v":{"$error":"#N/A"}}]
[null,{"$f":"VLOOKUP(A98,logistics!G:I,2,0)","v":{"$error":"#N/A"}},{"$f":"VLOOKUP(A98,logistics!G:I,3,0)","v":{"$error":"#N/A"}},null,{"$f":"VLOOKUP(D98,AllDocs!A:D,2,0)","v":{"$error":"#N/A"}},{"$f":"VLOOKUP(D98,AllDocs!A:D,3,0)","v":{"$error":"#N/A"}},{"$f":"VLOOKUP(D98,AllDocs!A:D,4,0)","v":{"$error":"#N/A"}},null,{"$f":"VLOOKUP(D98,AllDocs!A:F,6,0)","v":{"$error":"#N/A"}}]
[null,{"$f":"VLOOKUP(A99,logistics!G:I,2,0)","v":{"$error":"#N/A"}},{"$f":"VLOOKUP(A99,logistics!G:I,3,0)","v":{"$error":"#N/A"}},null,{"$f":"VLOOKUP(D99,AllDocs!A:D,2,0)","v":{"$error":"#N/A"}},{"$f":"VLOOKUP(D99,AllDocs!A:D,3,0)","v":{"$error":"#N/A"}},{"$f":"VLOOKUP(D99,AllDocs!A:D,4,0)","v":{"$error":"#N/A"}},null,{"$f":"VLOOKUP(D99,AllDocs!A:F,6,0)","v":{"$error":"#N/A"}}]
[null,{"$f":"VLOOKUP(A100,logistics!G:I,2,0)","v":{"$error":"#N/A"}},{"$f":"VLOOKUP(A100,logistics!G:I,3,0)","v":{"$error":"#N/A"}},null,{"$f":"VLOOKUP(D100,AllDocs!A:D,2,0)","v":{"$error":"#N/A"}},{"$f":"VLOOKUP(D100,AllDocs!A:D,3,0)","v":{"$error":"#N/A"}},{"$f":"VLOOKUP(D100,AllDocs!A:D,4,0)","v":{"$error":"#N/A"}},null,{"$f":"VLOOKUP(D100,AllDocs!A:F,6,0)","v":{"$error":"#N/A"}}]
[null,{"$f":"VLOOKUP(A101,logistics!G:I,2,0)","v":{"$error":"#N/A"}},{"$f":"VLOOKUP(A101,logistics!G:I,3,0)","v":{"$error":"#N/A"}},null,{"$f":"VLOOKUP(D101,AllDocs!A:D,2,0)","v":{"$error":"#N/A"}},{"$f":"VLOOKUP(D101,AllDocs!A:D,3,0)","v":{"$error":"#N/A"}},{"$f":"VLOOKUP(D101,AllDocs!A:D,4,0)","v":{"$error":"#N/A"}},null,{"$f":"VLOOKUP(D101,AllDocs!A:F,6,0)","v":{"$error":"#N/A"}}]
[null,{"$f":"VLOOKUP(A102,logistics!G:I,2,0)","v":{"$error":"#N/A"}},{"$f":"VLOOKUP(A102,logistics!G:I,3,0)","v":{"$error":"#N/A"}},null,{"$f":"VLOOKUP(D102,AllDocs!A:D,2,0)","v":{"$error":"#N/A"}},{"$f":"VLOOKUP(D102,AllDocs!A:D,3,0)","v":{"$error":"#N/A"}},{"$f":"VLOOKUP(D102,AllDocs!A:D,4,0)","v":{"$error":"#N/A"}},null,{"$f":"VLOOKUP(D102,AllDocs!A:F,6,0)","v":{"$error":"#N/A"}}]
[null,{"$f":"VLOOKUP(A103,logistics!G:I,2,0)","v":{"$error":"#N/A"}},{"$f":"VLOOKUP(A103,logistics!G:I,3,0)","v":{"$error":"#N/A"}},null,{"$f":"VLOOKUP(D103,AllDocs!A:D,2,0)","v":{"$error":"#N/A"}},{"$f":"VLOOKUP(D103,AllDocs!A:D,3,0)","v":{"$error":"#N/A"}},{"$f":"VLOOKUP(D103,AllDocs!A:D,4,0)","v":{"$error":"#N/A"}},null,{"$f":"VLOOKUP(D103,AllDocs!A:F,6,0)","v":{"$error":"#N/A"}}]
[null,{"$f":"VLOOKUP(A104,logistics!G:I,2,0)","v":{"$error":"#N/A"}},{"$f":"VLOOKUP(A104,logistics!G:I,3,0)","v":{"$error":"#N/A"}},null,{"$f":"VLOOKUP(D104,AllDocs!A:D,2,0)","v":{"$error":"#N/A"}},{"$f":"VLOOKUP(D104,AllDocs!A:D,3,0)","v":{"$error":"#N/A"}},{"$f":"VLOOKUP(D104,AllDocs!A:D,4,0)","v":{"$error":"#N/A"}},null,{"$f":"VLOOKUP(D104,AllDocs!A:F,6,0)","v":{"$error":"#N/A"}}]
[null,{"$f":"VLOOKUP(A105,logistics!G:I,2,0)","v":{"$error":"#N/A"}},{"$f":"VLOOKUP(A105,logistics!G:I,3,0)","v":{"$error":"#N/A"}},null,{"$f":"VLOOKUP(D105,AllDocs!A:D,2,0)","v":{"$error":"#N/A"}},{"$f":"VLOOKUP(D105,AllDocs!A:D,3,0)","v":{"$error":"#N/A"}},{"$f":"VLOOKUP(D105,AllDocs!A:D,4,0)","v":{"$error":"#N/A"}},null,{"$f":"VLOOKUP(D105,AllDocs!A:F,6,0)","v":{"$error":"#N/A"}}]
[null,{"$f":"VLOOKUP(A106,logistics!G:I,2,0)","v":{"$error":"#N/A"}},{"$f":"VLOOKUP(A106,logistics!G:I,3,0)","v":{"$error":"#N/A"}},null,{"$f":"VLOOKUP(D106,AllDocs!A:D,2,0)","v":{"$error":"#N/A"}},{"$f":"VLOOKUP(D106,AllDocs!A:D,3,0)","v":{"$error":"#N/A"}},{"$f":"VLOOKUP(D106,AllDocs!A:D,4,0)","v":{"$error":"#N/A"}},null,{"$f":"VLOOKUP(D106,AllDocs!A:F,6,0)","v":{"$error":"#N/A"}}]
[null,{"$f":"VLOOKUP(A107,logistics!G:I,2,0)","v":{"$error":"#N/A"}},{"$f":"VLOOKUP(A107,logistics!G:I,3,0)","v":{"$error":"#N/A"}},null,{"$f":"VLOOKUP(D107,AllDocs!A:D,2,0)","v":{"$error":"#N/A"}},{"$f":"VLOOKUP(D107,AllDocs!A:D,3,0)","v":{"$error":"#N/A"}},{"$f":"VLOOKUP(D107,AllDocs!A:D,4,0)","v":{"$error":"#N/A"}},null,{"$f":"VLOOKUP(D107,AllDocs!A:F,6,0)","v":{"$error":"#N/A"}}]
[null,{"$f":"VLOOKUP(A108,logistics!G:I,2,0)","v":{"$error":"#N/A"}},{"$f":"VLOOKUP(A108,logistics!G:I,3,0)","v":{"$error":"#N/A"}},null,{"$f":"VLOOKUP(D108,AllDocs!A:D,2,0)","v":{"$error":"#N/A"}},{"$f":"VLOOKUP(D108,AllDocs!A:D,3,0)","v":{"$error":"#N/A"}},{"$f":"VLOOKUP(D108,AllDocs!A:D,4,0)","v":{"$error":"#N/A"}},null,{"$f":"VLOOKUP(D108,AllDocs!A:F,6,0)","v":{"$error":"#N/A"}}]
[null,{"$f":"VLOOKUP(A109,logistics!G:I,2,0)","v":{"$error":"#N/A"}},{"$f":"VLOOKUP(A109,logistics!G:I,3,0)","v":{"$error":"#N/A"}},null,{"$f":"VLOOKUP(D109,AllDocs!A:D,2,0)","v":{"$error":"#N/A"}},{"$f":"VLOOKUP(D109,AllDocs!A:D,3,0)","v":{"$error":"#N/A"}},{"$f":"VLOOKUP(D109,AllDocs!A:D,4,0)","v":{"$error":"#N/A"}},null,{"$f":"VLOOKUP(D109,AllDocs!A:F,6,0)","v":{"$error":"#N/A"}}]
[null,{"$f":"VLOOKUP(A110,logistics!G:I,2,0)","v":{"$error":"#N/A"}},{"$f":"VLOOKUP(A110,logistics!G:I,3,0)","v":{"$error":"#N/A"}},null,{"$f":"VLOOKUP(D110,AllDocs!A:D,2,0)","v":{"$error":"#N/A"}},{"$f":"VLOOKUP(D110,AllDocs!A:D,3,0)","v":{"$error":"#N/A"}},{"$f":"VLOOKUP(D110,AllDocs!A:D,4,0)","v":{"$error":"#N/A"}},null,{"$f":"VLOOKUP(D110,AllDocs!A:F,6,0)","v":{"$error":"#N/A"}}]
[null,{"$f":"VLOOKUP(A111,logistics!G:I,2,0)","v":{"$error":"#N/A"}},{"$f":"VLOOKUP(A111,logistics!G:I,3,0)","v":{"$error":"#N/A"}},null,{"$f":"VLOOKUP(D111,AllDocs!A:D,2,0)","v":{"$error":"#N/A"}},{"$f":"VLOOKUP(D111,AllDocs!A:D,3,0)","v":{"$error":"#N/A"}},{"$f":"VLOOKUP(D111,AllDocs!A:D,4,0)","v":{"$error":"#N/A"}},null,{"$f":"VLOOKUP(D111,AllDocs!A:F,6,0)","v":{"$error":"#N/A"}}]
[null,{"$f":"VLOOKUP(A112,logistics!G:I,2,0)","v":{"$error":"#N/A"}},{"$f":"VLOOKUP(A112,logistics!G:I,3,0)","v":{"$error":"#N/A"}},null,{"$f":"VLOOKUP(D112,AllDocs!A:D,2,0)","v":{"$error":"#N/A"}},{"$f":"VLOOKUP(D112,AllDocs!A:D,3,0)","v":{"$error":"#N/A"}},{"$f":"VLOOKUP(D112,AllDocs!A:D,4,0)","v":{"$error":"#N/A"}},null,{"$f":"VLOOKUP(D112,AllDocs!A:F,6,0)","v":{"$error":"#N/A"}}]
[null,{"$f":"VLOOKUP(A113,logistics!G:I,2,0)","v":{"$error":"#N/A"}},{"$f":"VLOOKUP(A113,logistics!G:I,3,0)","v":{"$error":"#N/A"}},null,{"$f":"VLOOKUP(D113,AllDocs!A:D,2,0)","v":{"$error":"#N/A"}},{"$f":"VLOOKUP(D113,AllDocs!A:D,3,0)","v":{"$error":"#N/A"}},{"$f":"VLOOKUP(D113,AllDocs!A:D,4,0)","v":{"$error":"#N/A"}},null,{"$f":"VLOOKUP(D113,AllDocs!A:F,6,0)","v":{"$error":"#N/A"}}]
[null,{"$f":"VLOOKUP(A114,logistics!G:I,2,0)","v":{"$error":"#N/A"}},{"$f":"VLOOKUP(A114,logistics!G:I,3,0)","v":{"$error":"#N/A"}},null,{"$f":"VLOOKUP(D114,AllDocs!A:D,2,0)","v":{"$error":"#N/A"}},{"$f":"VLOOKUP(D114,AllDocs!A:D,3,0)","v":{"$error":"#N/A"}},{"$f":"VLOOKUP(D114,AllDocs!A:D,4,0)","v":{"$error":"#N/A"}},null,{"$f":"VLOOKUP(D114,AllDocs!A:F,6,0)","v":{"$error":"#N/A"}}]
[null,{"$f":"VLOOKUP(A115,logistics!G:I,2,0)","v":{"$error":"#N/A"}},{"$f":"VLOOKUP(A115,logistics!G:I,3,0)","v":{"$error":"#N/A"}},null,{"$f":"VLOOKUP(D115,AllDocs!A:D,2,0)","v":{"$error":"#N/A"}},{"$f":"VLOOKUP(D115,AllDocs!A:D,3,0)","v":{"$error":"#N/A"}},{"$f":"VLOOKUP(D115,AllDocs!A:D,4,0)","v":{"$error":"#N/A"}},null,{"$f":"VLOOKUP(D115,AllDocs!A:F,6,0)","v":{"$error":"#N/A"}}]
[null,{"$f":"VLOOKUP(A116,logistics!G:I,2,0)","v":{"$error":"#N/A"}},{"$f":"VLOOKUP(A116,logistics!G:I,3,0)","v":{"$error":"#N/A"}},null,{"$f":"VLOOKUP(D116,AllDocs!A:D,2,0)","v":{"$error":"#N/A"}},{"$f":"VLOOKUP(D116,AllDocs!A:D,3,0)","v":{"$error":"#N/A"}},{"$f":"VLOOKUP(D116,AllDocs!A:D,4,0)","v":{"$error":"#N/A"}},null,{"$f":"VLOOKUP(D116,AllDocs!A:F,6,0)","v":{"$error":"#N/A"}}]
[null,{"$f":"VLOOKUP(A117,logistics!G:I,2,0)","v":{"$error":"#N/A"}},{"$f":"VLOOKUP(A117,logistics!G:I,3,0)","v":{"$error":"#N/A"}},null,{"$f":"VLOOKUP(D117,AllDocs!A:D,2,0)","v":{"$error":"#N/A"}},{"$f":"VLOOKUP(D117,AllDocs!A:D,3,0)","v":{"$error":"#N/A"}},{"$f":"VLOOKUP(D117,AllDocs!A:D,4,0)","v":{"$error":"#N/A"}},null,{"$f":"VLOOKUP(D117,AllDocs!A:F,6,0)","v":{"$error":"#N/A"}}]
[null,{"$f":"VLOOKUP(A118,logistics!G:I,2,0)","v":{"$error":"#N/A"}},{"$f":"VLOOKUP(A118,logistics!G:I,3,0)","v":{"$error":"#N/A"}},null,{"$f":"VLOOKUP(D118,AllDocs!A:D,2,0)","v":{"$error":"#N/A"}},{"$f":"VLOOKUP(D118,AllDocs!A:D,3,0)","v":{"$error":"#N/A"}},{"$f":"VLOOKUP(D118,AllDocs!A:D,4,0)","v":{"$error":"#N/A"}},null,{"$f":"VLOOKUP(D118,AllDocs!A:F,6,0)","v":{"$error":"#N/A"}}]
[null,{"$f":"VLOOKUP(A119,logistics!G:I,2,0)","v":{"$error":"#N/A"}},{"$f":"VLOOKUP(A119,logistics!G:I,3,0)","v":{"$error":"#N/A"}},null,{"$f":"VLOOKUP(D119,AllDocs!A:D,2,0)","v":{"$error":"#N/A"}},{"$f":"VLOOKUP(D119,AllDocs!A:D,3,0)","v":{"$error":"#N/A"}},{"$f":"VLOOKUP(D119,AllDocs!A:D,4,0)","v":{"$error":"#N/A"}},null,{"$f":"VLOOKUP(D119,AllDocs!A:F,6,0)","v":{"$error":"#N/A"}}]
[null,{"$f":"VLOOKUP(A120,logistics!G:I,2,0)","v":{"$error":"#N/A"}},{"$f":"VLOOKUP(A120,logistics!G:I,3,0)","v":{"$error":"#N/A"}},null,{"$f":"VLOOKUP(D120,AllDocs!A:D,2,0)","v":{"$error":"#N/A"}},{"$f":"VLOOKUP(D120,AllDocs!A:D,3,0)","v":{"$error":"#N/A"}},{"$f":"VLOOKUP(D120,AllDocs!A:D,4,0)","v":{"$error":"#N/A"}},null,{"$f":"VLOOKUP(D120,AllDocs!A:F,6,0)","v":{"$error":"#N/A"}}]
[null,{"$f":"VLOOKUP(A121,logistics!G:I,2,0)","v":{"$error":"#N/A"}},{"$f":"VLOOKUP(A121,logistics!G:I,3,0)","v":{"$error":"#N/A"}},null,{"$f":"VLOOKUP(D121,AllDocs!A:D,2,0)","v":{"$error":"#N/A"}},{"$f":"VLOOKUP(D121,AllDocs!A:D,3,0)","v":{"$error":"#N/A"}},{"$f":"VLOOKUP(D121,AllDocs!A:D,4,0)","v":{"$error":"#N/A"}},null,{"$f":"VLOOKUP(D121,AllDocs!A:F,6,0)","v":{"$error":"#N/A"}}]
[null,{"$f":"VLOOKUP(A122,logistics!G:I,2,0)","v":{"$error":"#N/A"}},{"$f":"VLOOKUP(A122,logistics!G:I,3,0)","v":{"$error":"#N/A"}},null,{"$f":"VLOOKUP(D122,AllDocs!A:D,2,0)","v":{"$error":"#N/A"}},{"$f":"VLOOKUP(D122,AllDocs!A:D,3,0)","v":{"$error":"#N/A"}},{"$f":"VLOOKUP(D122,AllDocs!A:D,4,0)","v":{"$error":"#N/A"}},null,{"$f":"VLOOKUP(D122,AllDocs!A:F,6,0)","v":{"$error":"#N/A"}}]
[null,{"$f":"VLOOKUP(A123,logistics!G:I,2,0)","v":{"$error":"#N/A"}},{"$f":"VLOOKUP(A123,logistics!G:I,3,0)","v":{"$error":"#N/A"}},null,{"$f":"VLOOKUP(D123,AllDocs!A:D,2,0)","v":{"$error":"#N/A"}},{"$f":"VLOOKUP(D123,AllDocs!A:D,3,0)","v":{"$error":"#N/A"}},{"$f":"VLOOKUP(D123,AllDocs!A:D,4,0)","v":{"$error":"#N/A"}},null,{"$f":"VLOOKUP(D123,AllDocs!A:F,6,0)","v":{"$error":"#N/A"}}]
[null,{"$f":"VLOOKUP(A124,logistics!G:I,2,0)","v":{"$error":"#N/A"}},{"$f":"VLOOKUP(A124,logistics!G:I,3,0)","v":{"$error":"#N/A"}},null,{"$f":"VLOOKUP(D124,AllDocs!A:D,2,0)","v":{"$error":"#N/A"}},{"$f":"VLOOKUP(D124,AllDocs!A:D,3,0)","v":{"$error":"#N/A"}},{"$f":"VLOOKUP(D124,AllDocs!A:D,4,0)","v":{"$error":"#N/A"}},null,{"$f":"VLOOKUP(D124,AllDocs!A:F,6,0)","v":{"$error":"#N/A"}}]
[null,{"$f":"VLOOKUP(A125,logistics!G:I,2,0)","v":{"$error":"#N/A"}},{"$f":"VLOOKUP(A125,logistics!G:I,3,0)","v":{"$error":"#N/A"}},null,{"$f":"VLOOKUP(D125,AllDocs!A:D,2,0)","v":{"$error":"#N/A"}},{"$f":"VLOOKUP(D125,AllDocs!A:D,3,0)","v":{"$error":"#N/A"}},{"$f":"VLOOKUP(D125,AllDocs!A:D,4,0)","v":{"$error":"#N/A"}},null,{"$f":"VLOOKUP(D125,AllDocs!A:F,6,0)","v":{"$error":"#N/A"}}]
[null,{"$f":"VLOOKUP(A126,logistics!G:I,2,0)","v":{"$error":"#N/A"}},{"$f":"VLOOKUP(A126,logistics!G:I,3,0)","v":{"$error":"#N/A"}},null,{"$f":"VLOOKUP(D126,AllDocs!A:D,2,0)","v":{"$error":"#N/A"}},{"$f":"VLOOKUP(D126,AllDocs!A:D,3,0)","v":{"$error":"#N/A"}},{"$f":"VLOOKUP(D126,AllDocs!A:D,4,0)","v":{"$error":"#N/A"}},null,{"$f":"VLOOKUP(D126,AllDocs!A:F,6,0)","v":{"$error":"#N/A"}}]
[null,{"$f":"VLOOKUP(A127,logistics!G:I,2,0)","v":{"$error":"#N/A"}},{"$f":"VLOOKUP(A127,logistics!G:I,3,0)","v":{"$error":"#N/A"}},null,{"$f":"VLOOKUP(D127,AllDocs!A:D,2,0)","v":{"$error":"#N/A"}},{"$f":"VLOOKUP(D127,AllDocs!A:D,3,0)","v":{"$error":"#N/A"}},{"$f":"VLOOKUP(D127,AllDocs!A:D,4,0)","v":{"$error":"#N/A"}},null,{"$f":"VLOOKUP(D127,AllDocs!A:F,6,0)","v":{"$error":"#N/A"}}]
[null,{"$f":"VLOOKUP(A128,logistics!G:I,2,0)","v":{"$error":"#N/A"}},{"$f":"VLOOKUP(A128,logistics!G:I,3,0)","v":{"$error":"#N/A"}},null,{"$f":"VLOOKUP(D128,AllDocs!A:D,2,0)","v":{"$error":"#N/A"}},{"$f":"VLOOKUP(D128,AllDocs!A:D,3,0)","v":{"$error":"#N/A"}},{"$f":"VLOOKUP(D128,AllDocs!A:D,4,0)","v":{"$error":"#N/A"}},null,{"$f":"VLOOKUP(D128,AllDocs!A:F,6,0)","v":{"$error":"#N/A"}}]
[null,{"$f":"VLOOKUP(A129,logistics!G:I,2,0)","v":{"$error":"#N/A"}},{"$f":"VLOOKUP(A129,logistics!G:I,3,0)","v":{"$error":"#N/A"}},null,{"$f":"VLOOKUP(D129,AllDocs!A:D,2,0)","v":{"$error":"#N/A"}},{"$f":"VLOOKUP(D129,AllDocs!A:D,3,0)","v":{"$error":"#N/A"}},{"$f":"VLOOKUP(D129,AllDocs!A:D,4,0)","v":{"$error":"#N/A"}},null,{"$f":"VLOOKUP(D129,AllDocs!A:F,6,0)","v":{"$error":"#N/A"}}]
[null,{"$f":"VLOOKUP(A130,logistics!G:I,2,0)","v":{"$error":"#N/A"}},{"$f":"VLOOKUP(A130,logistics!G:I,3,0)","v":{"$error":"#N/A"}},null,{"$f":"VLOOKUP(D130,AllDocs!A:D,2,0)","v":{"$error":"#N/A"}},{"$f":"VLOOKUP(D130,AllDocs!A:D,3,0)","v":{"$error":"#N/A"}},{"$f":"VLOOKUP(D130,AllDocs!A:D,4,0)","v":{"$error":"#N/A"}},null,{"$f":"VLOOKUP(D130,AllDocs!A:F,6,0)","v":{"$error":"#N/A"}}]
[null,{"$f":"VLOOKUP(A131,logistics!G:I,2,0)","v":{"$error":"#N/A"}},{"$f":"VLOOKUP(A131,logistics!G:I,3,0)","v":{"$error":"#N/A"}},null,{"$f":"VLOOKUP(D131,AllDocs!A:D,2,0)","v":{"$error":"#N/A"}},{"$f":"VLOOKUP(D131,AllDocs!A:D,3,0)","v":{"$error":"#N/A"}},{"$f":"VLOOKUP(D131,AllDocs!A:D,4,0)","v":{"$error":"#N/A"}},null,{"$f":"VLOOKUP(D131,AllDocs!A:F,6,0)","v":{"$error":"#N/A"}}]
[null,{"$f":"VLOOKUP(A132,logistics!G:I,2,0)","v":{"$error":"#N/A"}},{"$f":"VLOOKUP(A132,logistics!G:I,3,0)","v":{"$error":"#N/A"}},null,{"$f":"VLOOKUP(D132,AllDocs!A:D,2,0)","v":{"$error":"#N/A"}},{"$f":"VLOOKUP(D132,AllDocs!A:D,3,0)","v":{"$error":"#N/A"}},{"$f":"VLOOKUP(D132,AllDocs!A:D,4,0)","v":{"$error":"#N/A"}},null,{"$f":"VLOOKUP(D132,AllDocs!A:F,6,0)","v":{"$error":"#N/A"}}]
[null,{"$f":"VLOOKUP(A133,logistics!G:I,2,0)","v":{"$error":"#N/A"}},{"$f":"VLOOKUP(A133,logistics!G:I,3,0)","v":{"$error":"#N/A"}},null,{"$f":"VLOOKUP(D133,AllDocs!A:D,2,0)","v":{"$error":"#N/A"}},{"$f":"VLOOKUP(D133,AllDocs!A:D,3,0)","v":{"$error":"#N/A"}},{"$f":"VLOOKUP(D133,AllDocs!A:D,4,0)","v":{"$error":"#N/A"}},null,{"$f":"VLOOKUP(D133,AllDocs!A:F,6,0)","v":{"$error":"#N/A"}}]
[null,{"$f":"VLOOKUP(A134,logistics!G:I,2,0)","v":{"$error":"#N/A"}},{"$f":"VLOOKUP(A134,logistics!G:I,3,0)","v":{"$error":"#N/A"}},null,{"$f":"VLOOKUP(D134,AllDocs!A:D,2,0)","v":{"$error":"#N/A"}},{"$f":"VLOOKUP(D134,AllDocs!A:D,3,0)","v":{"$error":"#N/A"}},{"$f":"VLOOKUP(D134,AllDocs!A:D,4,0)","v":{"$error":"#N/A"}},null,{"$f":"VLOOKUP(D134,AllDocs!A:F,6,0)","v":{"$error":"#N/A"}}]
[null,{"$f":"VLOOKUP(A135,logistics!G:I,2,0)","v":{"$error":"#N/A"}},{"$f":"VLOOKUP(A135,logistics!G:I,3,0)","v":{"$error":"#N/A"}},null,{"$f":"VLOOKUP(D135,AllDocs!A:D,2,0)","v":{"$error":"#N/A"}},{"$f":"VLOOKUP(D135,AllDocs!A:D,3,0)","v":{"$error":"#N/A"}},{"$f":"VLOOKUP(D135,AllDocs!A:D,4,0)","v":{"$error":"#N/A"}},null,{"$f":"VLOOKUP(D135,AllDocs!A:F,6,0)","v":{"$error":"#N/A"}}]
[null,{"$f":"VLOOKUP(A136,logistics!G:I,2,0)","v":{"$error":"#N/A"}},{"$f":"VLOOKUP(A136,logistics!G:I,3,0)","v":{"$error":"#N/A"}},null,{"$f":"VLOOKUP(D136,AllDocs!A:D,2,0)","v":{"$error":"#N/A"}},{"$f":"VLOOKUP(D136,AllDocs!A:D,3,0)","v":{"$error":"#N/A"}},{"$f":"VLOOKUP(D136,AllDocs!A:D,4,0)","v":{"$error":"#N/A"}},null,{"$f":"VLOOKUP(D136,AllDocs!A:F,6,0)","v":{"$error":"#N/A"}}]
[null,{"$f":"VLOOKUP(A137,logistics!G:I,2,0)","v":{"$error":"#N/A"}},{"$f":"VLOOKUP(A137,logistics!G:I,3,0)","v":{"$error":"#N/A"}},null,{"$f":"VLOOKUP(D137,AllDocs!A:D,2,0)","v":{"$error":"#N/A"}},{"$f":"VLOOKUP(D137,AllDocs!A:D,3,0)","v":{"$error":"#N/A"}},{"$f":"VLOOKUP(D137,AllDocs!A:D,4,0)","v":{"$error":"#N/A"}},null,{"$f":"VLOOKUP(D137,AllDocs!A:F,6,0)","v":{"$error":"#N/A"}}]
[null,{"$f":"VLOOKUP(A138,logistics!G:I,2,0)","v":{"$error":"#N/A"}},{"$f":"VLOOKUP(A138,logistics!G:I,3,0)","v":{"$error":"#N/A"}},null,{"$f":"VLOOKUP(D138,AllDocs!A:D,2,0)","v":{"$error":"#N/A"}},{"$f":"VLOOKUP(D138,AllDocs!A:D,3,0)","v":{"$error":"#N/A"}},{"$f":"VLOOKUP(D138,AllDocs!A:D,4,0)","v":{"$error":"#N/A"}},null,{"$f":"VLOOKUP(D138,AllDocs!A:F,6,0)","v":{"$error":"#N/A"}}]
[null,{"$f":"VLOOKUP(A139,logistics!G:I,2,0)","v":{"$error":"#N/A"}},{"$f":"VLOOKUP(A139,logistics!G:I,3,0)","v":{"$error":"#N/A"}},null,{"$f":"VLOOKUP(D139,AllDocs!A:D,2,0)","v":{"$error":"#N/A"}},{"$f":"VLOOKUP(D139,AllDocs!A:D,3,0)","v":{"$error":"#N/A"}},{"$f":"VLOOKUP(D139,AllDocs!A:D,4,0)","v":{"$error":"#N/A"}},null,{"$f":"VLOOKUP(D139,AllDocs!A:F,6,0)","v":{"$error":"#N/A"}}]
[null,{"$f":"VLOOKUP(A140,logistics!G:I,2,0)","v":{"$error":"#N/A"}},{"$f":"VLOOKUP(A140,logistics!G:I,3,0)","v":{"$error":"#N/A"}},null,{"$f":"VLOOKUP(D140,AllDocs!A:D,2,0)","v":{"$error":"#N/A"}},{"$f":"VLOOKUP(D140,AllDocs!A:D,3,0)","v":{"$error":"#N/A"}},{"$f":"VLOOKUP(D140,AllDocs!A:D,4,0)","v":{"$error":"#N/A"}},null,{"$f":"VLOOKUP(D140,AllDocs!A:F,6,0)","v":{"$error":"#N/A"}}]
[null,{"$f":"VLOOKUP(A141,logistics!G:I,2,0)","v":{"$error":"#N/A"}},{"$f":"VLOOKUP(A141,logistics!G:I,3,0)","v":{"$error":"#N/A"}},null,{"$f":"VLOOKUP(D141,AllDocs!A:D,2,0)","v":{"$error":"#N/A"}},{"$f":"VLOOKUP(D141,AllDocs!A:D,3,0)","v":{"$error":"#N/A"}},{"$f":"VLOOKUP(D141,AllDocs!A:D,4,0)","v":{"$error":"#N/A"}},null,{"$f":"VLOOKUP(D141,AllDocs!A:F,6,0)","v":{"$error":"#N/A"}}]
[null,{"$f":"VLOOKUP(A142,logistics!G:I,2,0)","v":{"$error":"#N/A"}},{"$f":"VLOOKUP(A142,logistics!G:I,3,0)","v":{"$error":"#N/A"}},null,{"$f":"VLOOKUP(D142,AllDocs!A:D,2,0)","v":{"$error":"#N/A"}},{"$f":"VLOOKUP(D142,AllDocs!A:D,3,0)","v":{"$error":"#N/A"}},{"$f":"VLOOKUP(D142,AllDocs!A:D,4,0)","v":{"$error":"#N/A"}},null,{"$f":"VLOOKUP(D142,AllDocs!A:F,6,0)","v":{"$error":"#N/A"}}]
[null,{"$f":"VLOOKUP(A143,logistics!G:I,2,0)","v":{"$error":"#N/A"}},{"$f":"VLOOKUP(A143,logistics!G:I,3,0)","v":{"$error":"#N/A"}},null,{"$f":"VLOOKUP(D143,AllDocs!A:D,2,0)","v":{"$error":"#N/A"}},{"$f":"VLOOKUP(D143,AllDocs!A:D,3,0)","v":{"$error":"#N/A"}},{"$f":"VLOOKUP(D143,AllDocs!A:D,4,0)","v":{"$error":"#N/A"}},null,{"$f":"VLOOKUP(D143,AllDocs!A:F,6,0)","v":{"$error":"#N/A"}}]
[null,{"$f":"VLOOKUP(A144,logistics!G:I,2,0)","v":{"$error":"#N/A"}},{"$f":"VLOOKUP(A144,logistics!G:I,3,0)","v":{"$error":"#N/A"}},null,{"$f":"VLOOKUP(D144,AllDocs!A:D,2,0)","v":{"$error":"#N/A"}},{"$f":"VLOOKUP(D144,AllDocs!A:D,3,0)","v":{"$error":"#N/A"}},{"$f":"VLOOKUP(D144,AllDocs!A:D,4,0)","v":{"$error":"#N/A"}},null,{"$f":"VLOOKUP(D144,AllDocs!A:F,6,0)","v":{"$error":"#N/A"}}]
[null,{"$f":"VLOOKUP(A145,logistics!G:I,2,0)","v":{"$error":"#N/A"}},{"$f":"VLOOKUP(A145,logistics!G:I,3,0)","v":{"$error":"#N/A"}},null,{"$f":"VLOOKUP(D145,AllDocs!A:D,2,0)","v":{"$error":"#N/A"}},{"$f":"VLOOKUP(D145,AllDocs!A:D,3,0)","v":{"$error":"#N/A"}},{"$f":"VLOOKUP(D145,AllDocs!A:D,4,0)","v":{"$error":"#N/A"}},null,{"$f":"VLOOKUP(D145,AllDocs!A:F,6,0)","v":{"$error":"#N/A"}}]
[null,{"$f":"VLOOKUP(A146,logistics!G:I,2,0)","v":{"$error":"#N/A"}},{"$f":"VLOOKUP(A146,logistics!G:I,3,0)","v":{"$error":"#N/A"}},null,{"$f":"VLOOKUP(D146,AllDocs!A:D,2,0)","v":{"$error":"#N/A"}},{"$f":"VLOOKUP(D146,AllDocs!A:D,3,0)","v":{"$error":"#N/A"}},{"$f":"VLOOKUP(D146,AllDocs!A:D,4,0)","v":{"$error":"#N/A"}},null,{"$f":"VLOOKUP(D146,AllDocs!A:F,6,0)","v":{"$error":"#N/A"}}]
[null,{"$f":"VLOOKUP(A147,logistics!G:I,2,0)","v":{"$error":"#N/A"}},{"$f":"VLOOKUP(A147,logistics!G:I,3,0)","v":{"$error":"#N/A"}},null,{"$f":"VLOOKUP(D147,AllDocs!A:D,2,0)","v":{"$error":"#N/A"}},{"$f":"VLOOKUP(D147,AllDocs!A:D,3,0)","v":{"$error":"#N/A"}},{"$f":"VLOOKUP(D147,AllDocs!A:D,4,0)","v":{"$error":"#N/A"}},null,{"$f":"VLOOKUP(D147,AllDocs!A:F,6,0)","v":{"$error":"#N/A"}}]
[null,{"$f":"VLOOKUP(A148,logistics!G:I,2,0)","v":{"$error":"#N/A"}},{"$f":"VLOOKUP(A148,logistics!G:I,3,0)","v":{"$error":"#N/A"}},null,{"$f":"VLOOKUP(D148,AllDocs!A:D,2,0)","v":{"$error":"#N/A"}},{"$f":"VLOOKUP(D148,AllDocs!A:D,3,0)","v":{"$error":"#N/A"}},{"$f":"VLOOKUP(D148,AllDocs!A:D,4,0)","v":{"$error":"#N/A"}},null,{"$f":"VLOOKUP(D148,AllDocs!A:F,6,0)","v":{"$error":"#N/A"}}]
[null,{"$f":"VLOOKUP(A149,logistics!G:I,2,0)","v":{"$error":"#N/A"}},{"$f":"VLOOKUP(A149,logistics!G:I,3,0)","v":{"$error":"#N/A"}},null,{"$f":"VLOOKUP(D149,AllDocs!A:D,2,0)","v":{"$error":"#N/A"}},{"$f":"VLOOKUP(D149,AllDocs!A:D,3,0)","v":{"$error":"#N/A"}},{"$f":"VLOOKUP(D149,AllDocs!A:D,4,0)","v":{"$error":"#N/A"}},null,{"$f":"VLOOKUP(D149,AllDocs!A:F,6,0)","v":{"$error":"#N/A"}}]
[null,{"$f":"VLOOKUP(A150,logistics!G:I,2,0)","v":{"$error":"#N/A"}},{"$f":"VLOOKUP(A150,logistics!G:I,3,0)","v":{"$error":"#N/A"}},null,{"$f":"VLOOKUP(D150,AllDocs!A:D,2,0)","v":{"$error":"#N/A"}},{"$f":"VLOOKUP(D150,AllDocs!A:D,3,0)","v":{"$error":"#N/A"}},{"$f":"VLOOKUP(D150,AllDocs!A:D,4,0)","v":{"$error":"#N/A"}},null,{"$f":"VLOOKUP(D150,AllDocs!A:F,6,0)","v":{"$error":"#N/A"}}]
[null,{"$f":"VLOOKUP(A151,logistics!G:I,2,0)","v":{"$error":"#N/A"}},{"$f":"VLOOKUP(A151,logistics!G:I,3,0)","v":{"$error":"#N/A"}},null,{"$f":"VLOOKUP(D151,AllDocs!A:D,2,0)","v":{"$error":"#N/A"}},{"$f":"VLOOKUP(D151,AllDocs!A:D,3,0)","v":{"$error":"#N/A"}},{"$f":"VLOOKUP(D151,AllDocs!A:D,4,0)","v":{"$error":"#N/A"}},null,{"$f":"VLOOKUP(D151,AllDocs!A:F,6,0)","v":{"$error":"#N/A"}}]
[null,{"$f":"VLOOKUP(A152,logistics!G:I,2,0)","v":{"$error":"#N/A"}},{"$f":"VLOOKUP(A152,logistics!G:I,3,0)","v":{"$error":"#N/A"}},null,{"$f":"VLOOKUP(D152,AllDocs!A:D,2,0)","v":{"$error":"#N/A"}},{"$f":"VLOOKUP(D152,AllDocs!A:D,3,0)","v":{"$error":"#N/A"}},{"$f":"VLOOKUP(D152,AllDocs!A:D,4,0)","v":{"$error":"#N/A"}},null,{"$f":"VLOOKUP(D152,AllDocs!A:F,6,0)","v":{"$error":"#N/A"}}]
[null,{"$f":"VLOOKUP(A153,logistics!G:I,2,0)","v":{"$error":"#N/A"}},{"$f":"VLOOKUP(A153,logistics!G:I,3,0)","v":{"$error":"#N/A"}},null,{"$f":"VLOOKUP(D153,AllDocs!A:D,2,0)","v":{"$error":"#N/A"}},{"$f":"VLOOKUP(D153,AllDocs!A:D,3,0)","v":{"$error":"#N/A"}},{"$f":"VLOOKUP(D153,AllDocs!A:D,4,0)","v":{"$error":"#N/A"}},null,{"$f":"VLOOKUP(D153,AllDocs!A:F,6,0)","v":{"$error":"#N/A"}}]
[null,{"$f":"VLOOKUP(A154,logistics!G:I,2,0)","v":{"$error":"#N/A"}},{"$f":"VLOOKUP(A154,logistics!G:I,3,0)","v":{"$error":"#N/A"}},null,{"$f":"VLOOKUP(D154,AllDocs!A:D,2,0)","v":{"$error":"#N/A"}},{"$f":"VLOOKUP(D154,AllDocs!A:D,3,0)","v":{"$error":"#N/A"}},{"$f":"VLOOKUP(D154,AllDocs!A:D,4,0)","v":{"$error":"#N/A"}},null,{"$f":"VLOOKUP(D154,AllDocs!A:F,6,0)","v":{"$error":"#N/A"}}]
[null,{"$f":"VLOOKUP(A155,logistics!G:I,2,0)","v":{"$error":"#N/A"}},{"$f":"VLOOKUP(A155,logistics!G:I,3,0)","v":{"$error":"#N/A"}},null,{"$f":"VLOOKUP(D155,AllDocs!A:D,2,0)","v":{"$error":"#N/A"}},{"$f":"VLOOKUP(D155,AllDocs!A:D,3,0)","v":{"$error":"#N/A"}},{"$f":"VLOOKUP(D155,AllDocs!A:D,4,0)","v":{"$error":"#N/A"}},null,{"$f":"VLOOKUP(D155,AllDocs!A:F,6,0)","v":{"$error":"#N/A"}}]

{"sheet":"logistics","index":1,"n_rows":33,"n_cols":12,"rows_kept":33,"cut":false,"hidden":false,"merged":[]}
["WeekDay","SlotTime","Day","Slot","Time","AllSlots","MAS Slots","Rooms","WGs","WIs","Short Name","Deadline"]
["Mon","9:00-10:30","Mon",1,"9:00-10:30",{"$f":"CONCATENATE(C2,\"-\",D2,\" (\",E2,\")\")","v":"Mon-1 (9:00-10:30)"},{"$f":"IF(COUNTA(I2),CELL(\"contents\",F2),\"\")","v":""},null,null,"TR-0001 (WI-0015)","Use Case Continuation","2018-07-09T13:00:00"]
["Tue","10:30-11:00","Mon",2,"11:00-12:30","Mon-2 (11:00-12:30)",{"$f":"IF(COUNTA(I3),CELL(\"contents\",F3),\"\")","v":"Mon-2 (11:00-12:30)"},2,"MAS","TR-0007 (WI-0053)","Semantic Study"]
["Wed","11:00-12:30","Mon",3,"14:00-15:30",{"$f":"CONCATENATE(C4,\"-\",D4,\" (\",E4,\")\")","v":"Mon-3 (14:00-15:30)"},"",null,null,"TR-0014 (WI-0018)","oneM2M AllJoyn Interworking"]
["Thu","12:30-13:30","Mon",4,"16:00-17:30",{"$f":"CONCATENATE(C5,\"-\",D5,\" (\",E5,\")\")","v":"Mon-4 (16:00-17:30)"},"Mon-4 (16:00-17:30)",2,"MAS","TR-0017 (WI-0017)","Home Domain Abstract Information Model"]
["Fri","13:30-15:00","Mon",5,null,"Mon-5 ()","",null,null,"TR-0018 (WI-0059)","Industry Domain Enablement"]
[null,"15:00-15:30","Tue",1,"9:00-10:30","Tue-1 (9:00-10:30)","",null,null,"TR-0022 (WI-0043)","Continuation & integration of HGI Smart Home activities"]
[null,"15:30-17:00","Tue",2,"11:00-12:30","Tue-2 (10:30-12:00)","",null,null,"TR-0031 (WI-0052)","LWM2M DM Interworking Enhancement"]
[null,"17:00-18:30","Tue",3,"13:30-15:00",{"$f":"CONCATENATE(C9,\"-\",D9,\" (\",E9,\")\")","v":"Tue-3 (13:30-15:00)"},"",null,null,"TR-0033 (WI-0053)","Study on Enhanced Semantic Enablement"]
[null,null,"Tue",4,"15:30-17:00","Tue-4 (15:30-17:00)","Tue-4 (15:30-17:00)",1,"REQ/MAS","TR-0039 (WI-0054)","Developer guide-SDT-based implementation"]
[null,"08:30-10:00","Tue",5,null,"Tue-5 ()","",null,null,"TR-0042 (WI-0071)","WoT Interworking"]
[null,"10:00-10:30","Wed",1,"9:00-10:30","Wed-1 (9:00-10:30)","Wed-1 (9:00-10:30)",2,"MAS","TR-0043 (WI-0072)","Modbus Interworking"]
[null,"10:30-12:00","Wed",2,"11:00-12:30","Wed-2 (11:00-12:30)","Wed-2 (11:00-12:30)",2,"MAS","TR-0045 (WI-0054)","Developer Guide: Implementing Semantics"]
[null,"12:00-13:30","Wed",3,"13:30-15:00","Wed-3 (13:30-15:00)","Wed-3 (13:30-15:00)",1,"ARC/MAS","TR-0046 (WI-0070)","Study on Disaster Alert Service Enabler"]
[null,"13:30-15:00","Wed",4,"15:30-17:00","Wed-4 (15:30-17:00)","Wed-4 (15:30-17:00)",2,"REQ/MAS","TR-0049 (WI-0075)","Industrial Domain Information Model Mapping & Semantics Support"]
[null,"15:00-15:30","Wed",5,null,"Wed-5 ()","",null,null,"TS-0001 (WI-0002)","Architecture"]
[null,"15:30-17:00","Thu",1,"9:00-10:30","Thu-1 (9:00-10:30)","Thu-1 (9:00-10:30)",2,"REQ/MAS","TS-0002 (WI-0001)","Requirement"]
[null,"17:00-18:30","Thu",2,"11:00-12:30","Thu-2 (11:00-12:30)","",null,null,"TS-0004 (WI-0009)","Protocol Core"]
[null,null,"Thu",3,"13:30-15:00","Thu-3 (13:30-15:00)","",null,null,"TS-0005 (WI-0010)","OMA Mapping"]
[null,null,"Thu",4,"15:30-17:00","Thu-4 (15:30-17:00)","Thu-4 (15:30-17:00)",2,"MAS","TS-0006 (WI-0010)","BBF Mapping"]
[null,null,"Thu",5,null,"Thu-5 ()","",null,null,"TS-0007 (WI-0011)","SOA Architecture"]
[null,null,"Thu",6,null,"Thu-6 ()","",null,null,"TS-0009 (WI-0013)","HTTP Binding"]
[null,null,"Fri",1,null,"Fri-1 ()","",null,null,"TS-0012 (WI-0063)","oneM2M Base Ontology"]
[null,null,"Fri",2,null,"Fri-2 ()","",null,null,"TS-0013 (WI-0060)","Interoperability Testing"]
[null,null,"Fri",3,null,"Fri-3 ()","",null,null,"TS-0014 (WI-0024)","LWM2M_Interworking"]
[null,null,"Fri",4,null,"Fri-4 ()","",null,null,"TS-0022 (WI-0088)","Field Device Configuration "]
[null,null,"Fri",5,null,"Fri-5 ()","",null,null,"TS-0023 (WI-0056)","Home Appliances Information Model and Mapping"]
[null,null,null,null,null,null,"",null,null,"TS-0030 (WI-0063)","Generic Interworking"]
[null,null,null,null,null,null,"",null,null,"TS-0033 (WI-0056)","Proximal Interworking"]
[null,null,null,null,null,null,{"$f":"IF(COUNTA(I30),CELL(\"contents\",F30),\"\")","v":""},null,null,"TS-0034 (WI-0053)","Semantic Support"]
[null,null,null,null,null,null,"",null,null,"SDT4.0 (WI-0081)","SDT4.0"]
[null,null,null,null,null,null,"",null,null,"TS-0023 (WI-0084)","SDT based Information Model and Mapping for Vertical Industries "]
[null,null,null,null,null,null,null,null,null,"Generic"]

{"sheet":"AllDocs","index":2,"n_rows":142,"n_cols":8,"rows_kept":142,"cut":false,"hidden":false,"merged":[]}
["SHORT DOC NB","SHORTNAME","SOURCE","UPLOADED","STATUS","DOC TYPE","VERS","MEETING"]
["TP-2018-0029","oneM2M_ARC_WG_intro_for_ITU-T_joint_meeting","ARC Chair","2018-01-16T21:56:06","Draft","INC",null,"TP 36"]
["TP-2018-0131","Invitation to TP36 WG meetings in Washington DC USA","ATIS","2018-03-19T19:23:13","Noted","INV",null,"TP 36 WGs only"]
["ARC-2018-0104","Feature_Catalogue_For_Semantics","Convida","2018-05-13T12:51:49","Draft","CR",null,"ARC 36"]
["ARC-2018-0111","Limitations_of_oneM2M_Requests_Towards_AEs","Convida","2018-05-13T21:37:09","Draft","INC",null,"ARC 36"]
["ARC-2018-0123","content forwarding","KT","2018-05-14T05:56:56","Draft","INC",null,"ARC 36"]
["ARC-2018-0124","content sharing resource forwarding","KT","2018-05-14T05:59:48","Draft","CR",null,"ARC 36"]
["ARC-2018-0115","Session QoS","Convida","2018-05-14T20:14:05","Draft","INC",null,"ARC 36"]
["ARC-2018-0152","CrossResourceSub_updates_R3","Convida","2018-05-22T08:27:13","Draft","CR",null,"ARC 36"]
["ARC-2018-0100R04","Issues_while_designing_IPE","Convida","2018-05-24T14:10:49","Draft","INC",null,"ARC 36"]
["PRO-2018-0185","TS-0004 Service Layer Core Protocol V2.18.0","TS-0004 Rapporteur (Nobu Uchida)","2018-06-07T07:41:11","Draft","INC",null,"TP 36 WGs only"]
["TP-2018-0196","Voting List TP36","Karen Hughes, Secretariat","2018-06-07T13:05:59","Draft","INC",null,"TP 36 WGs only"]
["PRO-2018-0184","TS-0004 Service Layer Core Protocol V3.8.0","TS-0004 Rapporteur (Nobu Uchida)","2018-06-11T04:54:25","Draft","INC",null,"TP 36 WGs only"]
["TP-2018-0202","Weekly Schedule TP36","Karen Hughes, Secretariat","2018-06-22T08:30:15","Draft","INC",null,"TP 36 WGs only"]
["TP-2018-0202R01","Weekly Schedule TP36","Karen Hughes, Secretariat","2018-06-22T08:54:25","Draft","INC",null,"TP 36 WGs only"]
["TST-2018-0117","TS-0013-Interoperability_Testing-V2_6_0","ETSI","2018-07-02T07:59:59","Draft","INC",null,"TST 36"]
["TST-2018-0118","TR-0051-oneM2M_API_guide-V0_1_0","ETSI","2018-07-02T10:12:47","Draft","INC",null,"TST 36"]
["MAS-2018-0077R01","WI-0053 Update","Convida","2018-07-02T15:37:18","Agreed","CR",null,"MAS 36"]
["TST-2018-0119","TS-0018_baseline_v2_5_0","KETI","2018-07-03T01:31:23","Draft","INC",null,"TST 36"]
["TP-2018-0202R02","Weekly Schedule TP36","Karen Hughes, Secretariat","2018-07-03T08:27:04","Draft","INC",null,"TP 36 WGs only"]
["MAS-2018-0081R01","SDT4 change log","Yongjing Zhang (Huawei)","2018-07-03T09:41:51","Draft","CR",null,"MAS 36"]
["MAS-2018-0084","SDT4 JSON","Yongjing Zhang (Huawei)","2018-07-04T03:36:11","Draft","CR",null,"MAS 36"]
["MAS-2018-0085","SDT4 removing Module","Yongjing Zhang (Huawei)","2018-07-04T03:36:21","Draft","CR",null,"MAS 36"]
["MAS-2018-0082","Introducing Product in SDT4","Yongjing Zhang (Huawei)","2018-07-04T03:36:34","Draft","CR",null,"MAS 36"]
["TP-2018-0203","LS from GCF on oneM2M certification status","GCF","2018-07-04T13:01:21","Draft","LS",null,"TP 36 WGs only"]
["TP-2018-0204","New Broadband Forum Contact and 2019 Meeting Dates","BroadBand Forum","2018-07-04T13:11:18","Draft","LS",null,"TP 36 WGs only"]
["ARC-2018-0173","TS-0014_baseline_v2_1_0","NTT","2018-07-06T07:10:00","Draft","INC",null,"ARC 36"]
["ARC-2018-0173R01","TS-0014_baseline_v2_1_0","NTT","2018-07-06T07:14:00","Draft","INC",null,"ARC 36"]
["ARC-2018-0174","TS-0014_baseline_v3_2_0","NTT","2018-07-06T07:18:34","Draft","INC",null,"ARC 36"]
["MAS-2018-0095","Algorithm for short names for TS-0023","Andreas Kraft (Deutsche Telekom)","2018-07-06T10:52:46","Draft","CR",null,"MAS 36"]
["MAS-2018-0096","Triggering Continuous Reasoning Process","Convida Wireless","2018-07-07T18:48:36","Noted","INC",null,"MAS 36"]
["ARC-2018-0175","Subscription_NotificationEventType_Blocking_R3","Convida","2018-07-08T12:49:42","Draft","CR",null,"ARC 36"]
["ARC-2018-0176","UE Reachability monitoring","KT","2018-07-09T00:10:59","Draft","CR",null,"ARC 36"]
["ARC-2018-0177","UE Availability after DDN Failure","KT","2018-07-09T00:14:47","Draft","CR",null,"ARC 36"]
["ARC-2018-0178","UE Communication Failure","KT","2018-07-09T00:16:49","Draft","CR",null,"ARC 36"]
["ARC-2018-0179","UE Loss of Connectivity","KT","2018-07-09T00:19:13","Draft","CR",null,"ARC 36"]
["ARC-2018-0180","Detecting Change of IMSI-IMEI(SV) Association","KT","2018-07-09T00:21:39","Draft","CR",null,"ARC 36"]
["ARC-2018-0181","Roaming Status","KT","2018-07-09T00:23:31","Draft","CR",null,"ARC 36"]
["REQ-2018-0043","Use_case_of_Smart_Factories_using_Edge_Fog","KDDI, Hitachi","2018-07-09T00:25:59","Draft","INC",null,"REQ 36"]
["ARC-2018-0182","Location Reporting","KT","2018-07-09T00:26:21","Draft","CR",null,"ARC 36"]
["ARC-2018-0183","Resource Type locationPolicy","KT","2018-07-09T00:28:03","Draft","CR",null,"ARC 36"]
["ARC-2018-0184","check for monitoring events","KT","2018-07-09T00:30:22","Draft","CR",null,"ARC 36"]
["REQ-2018-0044","TS-0002-Requirements-V4_3_0","Huawei (BEI XU)","2018-07-09T01:05:28","Draft","CR",null,"REQ 36"]
["ARC-2018-0185","TS0026-UE_Reachability_monitoring","Huawei (BEI XU)","2018-07-09T01:15:40","Draft","CR",null,"ARC 36"]
["ARC-2018-0186","TS0026_Node_Management","Huawei (BEI XU)","2018-07-09T01:19:16","Draft","CR",null,"ARC 36"]
["ARC-2018-0187","Group_Schedule_solution_discussion","Huawei (BEI XU)","2018-07-09T01:59:18","Draft","INC",null,"ARC 36"]
["MAS-2018-0097","TR-0049_v0.1.0_New_Baseline","Hitachi","2018-07-09T02:05:38","Agreed","CR",null,"MAS 36"]
["ARC-2018-0191","TS-0031_HAIM_related_features","Convida","2018-07-09T03:26:33","Draft","CR",null,"ARC 36"]
["ARC-2018-0192","TS-0026_3GPP_Interworking_Cleanup","Convida","2018-07-09T03:40:33","Draft","CR",null,"ARC 36"]
["ARC-2018-0193","Notificaion Target Discussion","Hyundai Motors","2018-07-09T05:11:43","Draft","INC",null,"ARC 36"]
["REQ-2018-0044R01","TS-0002-Requirements-V4_3_0","Huawei (BEI XU)","2018-07-09T06:22:32","Draft","CR",null,"REQ 36"]
["MAS-2018-0098","SDT_for_design_of_content_attribute","NTT","2018-07-09T06:53:38","Draft","CR",null,"MAS 36"]
["ARC-2018-0194","TR-0055-3GPP_V2X_Interworking-V0_2_0","Huawei (BEI XU)","2018-07-09T07:06:35","Draft","CR",null,"ARC 36"]
["ARC-2018-0195","TR-0056_Summary_of_Differences_between _Rel-2A & Rel-3_Skeleton","NTT","2018-07-09T08:14:40","Draft","INC",null,"ARC 36"]
["REQ-2018-0048","use_case_for_automatic_ontology_mapping","CMCC,Huawei","2018-07-09T08:43:25","Draft","CR",null,"REQ 36"]
["REQ-2018-0049","use_case_for_ontology_mapping_conflict_detection","CMCC, Huawei","2018-07-09T09:08:19","Draft","CR",null,"REQ 36"]
["REQ-2018-0050","use_case_for_ontology_mapping_conflict_repair","CMCC, Huawei","2018-07-09T09:11:46","Draft","CR",null,"REQ 36"]
["REQ-2018-0051","Requirement_for_automatic_ontology_mapping_Use_case","CMCC, Huawei","2018-07-09T09:16:49","Draft","CR",null,"REQ 36"]
["REQ-2018-0052","Requirement_for_ ontology_mapping_conflict_detection _Use_case","CMCC, Huawei","2018-07-09T09:19:46","Draft","CR",null,"REQ 36"]
["REQ-2018-0053","Requirement_for_ ontology_mapping_conflict_repair _Use_case","CMCC, Huawei","2018-07-09T09:21:48","Draft","CR",null,"REQ 36"]
["REQ-2018-0048R01","use_case_for_automatic_ontology_mapping","CMCC,Huawei","2018-07-09T09:23:14","Draft","CR",null,"REQ 36"]
["MAS-2018-0099R01","Adding_a_new_element_to_TS-0023","CMCC, Huawei","2018-07-09T09:31:27","Draft","CR",null,"MAS 36"]
["MAS-2018-0100","Adding_a_few_new_elements_for_DataPoints_of_refrigeration _ModuleClass","CMCC, Huawei","2018-07-09T09:33:43","Draft","CR",null,"MAS 36"]
["MAS-2018-0101","Adding_a_few_new_elements_for_Device_model","CMCC, Huawei","2018-07-09T09:36:57","Draft","CR",null,"MAS 36"]
["REQ-2018-0045","Potential automotive Use Cases for Edge/Fog Computing","Hyundai Motor","2018-07-09T09:52:39","Draft","INC",null,"REQ 36"]
["REQ-2018-0046","Discussion on Vulnerable Road User Discovery Use Case","Hyundai Motor","2018-07-09T09:53:57","Draft","INC",null,"REQ 36"]
["MAS-2018-0102","Analysis of industrial domain information models","Hitachi","2018-07-09T10:06:41","Draft","INC",null,"MAS 36"]
["REQ-2018-0047","Vulnerable Road User Discovery Use Case for Edge/Fog Computing","Hyundai Motor","2018-07-09T10:45:07","Draft","INC",null,"REQ 36"]
["MAS-2018-0094","Smart City model - street light","Yongjing Zhang (Huawei)","2018-07-09T10:58:14","Noted","CR",null,"MAS 36"]
["MAS-2018-0093","Smart City model - air quality monitor","Yongjing Zhang (Huawei), Yawen Niu (CMCC)","2018-07-09T10:59:29","Noted","CR",null,"MAS 36"]
["MAS-2018-0092","Smart City model - water quality monitor","Yongjing Zhang (Huawei)","2018-07-09T11:01:27","Draft","CR",null,"MAS 36"]
["MAS-2018-0091","Smart City model - parking detector","Yongjing Zhang (Huawei)","2018-07-09T11:01:42","Draft","CR",null,"MAS 36"]
["MAS-2018-0090","Smart City model - water meter","Yongjing Zhang (Huawei)","2018-07-09T11:01:55","Draft","CR",null,"MAS 36"]
["MAS-2018-0089","Smart City model - gas meter","Yongjing Zhang (Huawei)","2018-07-09T11:02:06","Noted","CR",null,"MAS 36"]
["REQ-2018-0055","use case for semantic query and discovery based on ontology mapping","Yongjing Zhang (Huawei), Yawen Niu (CMCC)","2018-07-09T11:12:35","Draft","CR",null,"REQ 36"]
["REQ-2018-0056","use case for semantic control based on ontology mapping.","Yongjing Zhang (Huawei), Yawen Niu (CMCC)","2018-07-09T11:12:51","Draft","CR",null,"REQ 36"]
["REQ-2018-0057","TS-0002 Requirements for semantic query and discovery based on ontology mapping","Yongjing Zhang (Huawei), Yawen Niu (CMCC)","2018-07-09T11:13:02","Draft","CR",null,"REQ 36"]
["REQ-2018-0058","TS-0002 Requirements for semantic control based on ontology mapping","Yongjing Zhang (Huawei), Yawen Niu (CMCC)","2018-07-09T11:13:12","Draft","CR",null,"REQ 36"]
["MAS-2018-0087","Agenda MAS#36","Yongjing Zhang (Huawei, MAS Chair)","2018-07-09T13:16:14","Noted","AG",null,"MAS 36"]
["MAS-2018-0088","Doc Allocation MAS#36","Yongjing Zhang (Huawei, MAS Chair)","2018-07-09T13:16:26","Noted","AG",null,"MAS 36"]
["ARC-2018-0201","TR-0026 multiple registrations key issue","Convida","2018-07-09T19:33:42","Draft","CR",null,"ARC 36"]
["ARC-2018-0202","Edge Fog nomenclature proposal","Convida, KDDI","2018-07-09T19:35:26","Draft","CR",null,"ARC 36"]
["ARC-2018-0203","TR-0052 Edge Fog nomenclature","Convida, KDDI","2018-07-09T19:36:18","Draft","CR",null,"ARC 36"]
["ARC-2018-0196","Data_delivery_optimization_scenario_using_Radio_information_for Edge_Fog_Computing","KDDI","2018-07-09T22:51:35","Draft","INC",null,"ARC 36"]
["ARC-2018-0204","TR-0036-oneTransport_for_Smart_Cities","Convida","2018-07-10T00:41:39","Draft","INC",null,"ARC 36"]
["ARC-2018-0205","New TR-0054 Baseline","Convida","2018-07-10T01:17:57","Draft","INC",null,"ARC 36"]
["ARC-2018-0115R01","Session QoS","Convida","2018-07-10T01:48:35","Draft","INC",null,"ARC 36"]
["ARC-2018-0197","Introduction to The Newly Proposed Access Control Policy","Datang","2018-07-10T02:46:17","Draft","INC",null,"ARC 36"]
["ARC-2018-0198","Introduction to The Newly Proposed Access Control Policy_Example_#1","Datang","2018-07-10T02:47:03","Draft","INC",null,"ARC 36"]
["ARC-2018-0199","Introduction to The Newly Proposed Access Control Policy_Example_#2","Datang","2018-07-10T02:47:18","Draft","INC",null,"ARC 36"]
["ARC-2018-0200","Introduction to The Newly Proposed Access Control Policy_Example_#3","Datang","2018-07-10T02:47:32","Draft","INC",null,"ARC 36"]
["ARC-2018-0195R01","TR-0056_Summary_of_Differences_between _Rel-2A & Rel-3_Skeleton","NTT","2018-07-10T06:32:59","Draft","INC",null,"ARC 36"]
["ARC-2018-0188","TS0001-3GPP_QoS_Resource_structure","Huawei (BEI XU)","2018-07-10T06:34:05","Draft","CR",null,"ARC 36"]
["ARC-2018-0189","TS0026-3GPP_QoS","Huawei (BEI XU)","2018-07-10T06:35:06","Draft","CR",null,"ARC 36"]
["MAS-2018-0094R01","Smart City model - street light","Yongjing Zhang (Huawei)","2018-07-10T09:09:14","Noted","CR",null,"MAS 36"]
["MAS-2018-0103","SDT 4.0 鈥?Introducing Enumerations","Andreas Kraft (Deutsche Telekom)","2018-07-10T13:09:53","Draft","CR",null,"MAS 36"]
["MAS-2018-0104","SDT 4.0 鈥?Introducing Referenced DataTypes","Andreas Kraft (Deutsche Telekom)","2018-07-10T13:10:48","Draft","CR",null,"MAS 36"]
["ARC-2018-0206","Action Triggering resources procedures from TR-0021","Convida","2018-07-10T19:41:46","Draft","CR",null,"ARC 36"]
["REQ-2018-0060","Lightweight services TS-0002 requirements","Convida","2018-07-10T21:12:23","Draft","CR",null,"REQ 36"]
["REQ-2018-0059","Service subscriber TS-0002 requirements","Convida","2018-07-10T21:13:04","Draft","CR",null,"REQ 36"]
["ARC-2018-0114R03","TS-0001_Cleanup_Authorization","Convida","2018-07-10T21:45:37","Draft","CR",null,"ARC 36"]
["ARC-2018-0138","TR-0036 smart city - introduction","KETI","2018-07-11T08:24:07","Draft","CR",null,"ARC 36"]
["REQ-2018-0061","Resource reservation for public services usecase","Convida","2018-07-11T13:46:45","Draft","CR",null,"REQ 36"]
["ARC-2018-0201R01","TR-0026 multiple registrations key issue","Convida","2018-07-11T17:54:49","Draft","CR",null,"ARC 36"]
["REQ-2018-0054","TR-0026_KI_and_Solution_of_V2V_network_interface_switching_management","Huawei (BEI XU)","2018-07-12T07:39:47","Draft","CR",null,"REQ 36"]
["ARC-2018-0207","Modification_to_Announcement_Description","NTT","2018-07-12T07:50:02","Draft","CR",null,"ARC 36"]
["MAS-2018-0098R01","SDT_for_design_of_content_attribute","NTT","2018-07-12T08:13:14","Draft","CR",null,"MAS 36"]
["ARC-2018-0208","TR-0026_KI_and_Solution_of_V2V_network_interface_switching_management","Huawei (BEI XU)","2018-07-12T09:03:15","Draft","CR",null,"ARC 36"]
["MAS-2018-0105","Changes in DataPoints tables structure","Orange","2018-07-12T12:04:15","Noted","CR",null,"MAS 36"]
["ARC-2018-0209","CR_TriggerPayloadSerialization_AttributeRemoval_R3","Convida","2018-07-12T14:00:37","Draft","CR",null,"ARC 36"]
["ARC-2018-0210","CR_TriggerValidityTime_Multiplicity_R3","Convida","2018-07-12T14:02:29","Draft","CR",null,"ARC 36"]
["ARC-2018-0211","CR_Content_Serialization_Response_R3","Convida","2018-07-12T14:04:16","Draft","CR",null,"ARC 36"]
["ARC-2018-0212","CR_Content_Serialization_Response_R2","Convida","2018-07-12T14:06:23","Draft","CR",null,"ARC 36"]
["ARC-2018-0213","CR_Location_Policy_Reports_R4","Convida","2018-07-12T14:09:10","Draft","CR",null,"ARC 36"]
["ARC-2018-0214","CR_LocationPolicy_Parent_R4","Convida","2018-07-12T14:51:47","Draft","CR",null,"ARC 36"]
["MAS-2018-0106","Add wifiClient management object to TS-0022","Orange","2018-07-13T10:36:38","Draft","CR",null,"MAS 36"]
["MAS-2018-0107","Assingments of particular Devices to specific domains","Orange","2018-07-13T11:12:42","Draft","CR",null,"MAS 36"]
["REQ-2018-0062","REQ 36 Allocation Document","Shelby Kiewel, iconectiv, WG1 Chairman","2018-07-13T13:20:32","Draft","AG",null,"REQ 36"]
["REQ-2018-0063","REQ 36 Agenda","Shelby Kiewel, iconectiv, WG1 Chairman","2018-07-13T13:31:15","Draft","AG",null,"REQ 36"]
["ARC-2018-0217","TS-0026_editorial_corrections_of_UE_Attach_with_oneM2M_Registration","KDDI","2018-07-14T14:40:08","Draft","CR",null,"ARC 36"]
["ARC-2018-0217R01","TS-0026_editorial_corrections_of_UE_Attach_with_oneM2M_Registration","KDDI","2018-07-14T14:51:02","Draft","CR",null,"ARC 36"]
["ARC-2018-0218","pollingChannelResponses_R3","Convida","2018-07-15T16:17:08","Draft","CR",null,"ARC 36"]
["MAS-2018-0108","TR-0046-V0_1_0 New baseline","SyncTechno, KETI","2018-07-15T23:50:14","Draft","INC",null,"MAS 36"]
["ARC-2018-0220","multimediaSession child resource types","KETI","2018-07-15T23:52:45","Draft","CR",null,"ARC 36"]
["MAS-2018-0109","Abstract_information_models_for_public_warning_services","SyncTechno, KETI","2018-07-15T23:53:53","Draft","INC",null,"MAS 36"]
["ARC-2018-0022R06","TS-0001 editors note cleanup assignment","KETI","2018-07-16T00:08:44","Draft","INC",null,"ARC 36"]
["ARC-2018-0192R01","TS-0026_3GPP_Interworking_Cleanup","Convida","2018-07-16T00:45:25","Draft","CR",null,"ARC 36"]
["ARC-2018-0221","Discussion on Rel-4 TS-0001 Simplification","KETI","2018-07-16T02:45:57","Draft","INC",null,"ARC 36"]
["ARC-2018-0215","ARC36_Document_Allocation","ARC Chair","2018-07-16T12:15:59","Draft","AG",null,"ARC 36"]
["ARC-2018-0216","ARC_36_meeting_agenda","ARC Chair","2018-07-16T12:17:30","Draft","AG",null,"ARC 36"]
["MAS-2018-0110","HAIM_Data_Model_issues","Convida","2018-07-16T12:46:01","Draft","INC",null,"MAS 36"]
["MAS-2018-0087R01","Agenda MAS#36","Yongjing Zhang (Huawei, MAS Chair)","2018-07-16T15:23:10","Agreed","AG",null,"MAS 36"]
["MAS-2018-0088R01","Doc Allocation MAS#36","Yongjing Zhang (Huawei, MAS Chair)","2018-07-16T15:23:44","Noted","AG",null,"MAS 36"]
["MAS-2018-0111","new data types for [wifiClient] management object","Orange","2018-07-16T16:24:11","Draft","CR",null,"MAS 36"]
["MAS-2018-0094R02","Smart City model - street light","Yongjing Zhang (Huawei)","2018-07-16T23:58:01","Draft","CR",null,"MAS 36"]
["MAS-2018-0089R01","Smart City model - gas meter","Yongjing Zhang (Huawei)","2018-07-16T23:58:43","Draft","CR",null,"MAS 36"]
["MAS-2018-0093R01","Smart City model - air quality monitor","Yongjing Zhang (Huawei), Yawen Niu (CMCC)","2018-07-17T00:00:20","Draft","CR",null,"MAS 36"]
["SHORT DOC NB","SHORTNAME","SOURCE","UPLOADED","STATUS","DOC TYPE","VERS","MEETING"]
["SHORT DOC NB","SHORTNAME","SOURCE","UPLOADED","STATUS","DOC TYPE","VERS","MEETING"]
["ARC-2018-0190","TS0026-3GPP_MBMS_Group","Huawei (BEI XU)",null,"Draft","CR",null,"ARC 36"]
["MAS-2018-0099","Adding_a_new_element_to_TS-0023","CMCC, Huawei",null,"Draft","CR",null,"MAS 36"]
["MAS-2018-0083","SDT4 DeviceClass","Yongjing Zhang (Huawei)",null,"Draft","CR",null,"MAS 36"]

{"sheet":"TP","index":3,"n_rows":11,"n_cols":8,"rows_kept":11,"cut":false,"hidden":false,"merged":[]}
["SHORT DOC NB","SHORTNAME","SOURCE","UPLOADED","STATUS","DOC TYPE","VERS","MEETING"]
["TP-2018-0029","oneM2M_ARC_WG_intro_for_ITU-T_joint_meeting","ARC Chair","2018-01-16T21:56:06","Draft","INC",null,"TP 36"]
["TP-2018-0131","Invitation to TP36 WG meetings in Washington DC USA","ATIS","2018-03-19T19:23:13","Noted","INV",null,"TP 36 WGs only"]
["PRO-2018-0185","TS-0004 Service Layer Core Protocol V2.18.0","TS-0004 Rapporteur (Nobu Uchida)","2018-06-07T07:41:11","Draft","INC",null,"TP 36 WGs only"]
["TP-2018-0196","Voting List TP36","Karen Hughes, Secretariat","2018-06-07T13:05:59","Draft","INC",null,"TP 36 WGs only"]
["PRO-2018-0184","TS-0004 Service Layer Core Protocol V3.8.0","TS-0004 Rapporteur (Nobu Uchida)","2018-06-11T04:54:25","Draft","INC",null,"TP 36 WGs only"]
["TP-2018-0202","Weekly Schedule TP36","Karen Hughes, Secretariat","2018-06-22T08:30:15","Draft","INC",null,"TP 36 WGs only"]
["TP-2018-0202R01","Weekly Schedule TP36","Karen Hughes, Secretariat","2018-06-22T08:54:25","Draft","INC",null,"TP 36 WGs only"]
["TP-2018-0202R02","Weekly Schedule TP36","Karen Hughes, Secretariat","2018-07-03T08:27:04","Draft","INC",null,"TP 36 WGs only"]
["TP-2018-0203","LS from GCF on oneM2M certification status","GCF","2018-07-04T13:01:21","Draft","LS",null,"TP 36 WGs only"]
["TP-2018-0204","New Broadband Forum Contact and 2019 Meeting Dates","BroadBand Forum","2018-07-04T13:11:18","Draft","LS",null,"TP 36 WGs only"]

{"sheet":"REQ","index":4,"n_rows":24,"n_cols":8,"rows_kept":24,"cut":false,"hidden":false,"merged":[]}
["SHORT DOC NB","SHORTNAME","SOURCE","UPLOADED","STATUS","DOC TYPE","VERS","MEETING"]
["REQ-2018-0043","Use_case_of_Smart_Factories_using_Edge_Fog","KDDI, Hitachi","2018-07-09T00:25:59","Draft","INC",null,"REQ 36"]
["REQ-2018-0044","TS-0002-Requirements-V4_3_0","Huawei (BEI XU)","2018-07-09T01:05:28","Draft","CR",null,"REQ 36"]
["REQ-2018-0044R01","TS-0002-Requirements-V4_3_0","Huawei (BEI XU)","2018-07-09T06:22:32","Draft","CR",null,"REQ 36"]
["REQ-2018-0048","use_case_for_automatic_ontology_mapping","CMCC,Huawei","2018-07-09T08:43:25","Draft","CR",null,"REQ 36"]
["REQ-2018-0049","use_case_for_ontology_mapping_conflict_detection","CMCC, Huawei","2018-07-09T09:08:19","Draft","CR",null,"REQ 36"]
["REQ-2018-0050","use_case_for_ontology_mapping_conflict_repair","CMCC, Huawei","2018-07-09T09:11:46","Draft","CR",null,"REQ 36"]
["REQ-2018-0051","Requirement_for_automatic_ontology_mapping_Use_case","CMCC, Huawei","2018-07-09T09:16:49","Draft","CR",null,"REQ 36"]
["REQ-2018-0052","Requirement_for_ ontology_mapping_conflict_detection _Use_case","CMCC, Huawei","2018-07-09T09:19:46","Draft","CR",null,"REQ 36"]
["REQ-2018-0053","Requirement_for_ ontology_mapping_conflict_repair _Use_case","CMCC, Huawei","2018-07-09T09:21:48","Draft","CR",null,"REQ 36"]
["REQ-2018-0048R01","use_case_for_automatic_ontology_mapping","CMCC,Huawei","2018-07-09T09:23:14","Draft","CR",null,"REQ 36"]
["REQ-2018-0045","Potential automotive Use Cases for Edge/Fog Computing","Hyundai Motor","2018-07-09T09:52:39","Draft","INC",null,"REQ 36"]
["REQ-2018-0046","Discussion on Vulnerable Road User Discovery Use Case","Hyundai Motor","2018-07-09T09:53:57","Draft","INC",null,"REQ 36"]
["REQ-2018-0047","Vulnerable Road User Discovery Use Case for Edge/Fog Computing","Hyundai Motor","2018-07-09T10:45:07","Draft","INC",null,"REQ 36"]
["REQ-2018-0055","use case for semantic query and discovery based on ontology mapping","Yongjing Zhang (Huawei), Yawen Niu (CMCC)","2018-07-09T11:12:35","Draft","CR",null,"REQ 36"]
["REQ-2018-0056","use case for semantic control based on ontology mapping.","Yongjing Zhang (Huawei), Yawen Niu (CMCC)","2018-07-09T11:12:51","Draft","CR",null,"REQ 36"]
["REQ-2018-0057","TS-0002 Requirements for semantic query and discovery based on ontology mapping","Yongjing Zhang (Huawei), Yawen Niu (CMCC)","2018-07-09T11:13:02","Draft","CR",null,"REQ 36"]
["REQ-2018-0058","TS-0002 Requirements for semantic control based on ontology mapping","Yongjing Zhang (Huawei), Yawen Niu (CMCC)","2018-07-09T11:13:12","Draft","CR",null,"REQ 36"]
["REQ-2018-0060","Lightweight services TS-0002 requirements","Convida","2018-07-10T21:12:23","Draft","CR",null,"REQ 36"]
["REQ-2018-0059","Service subscriber TS-0002 requirements","Convida","2018-07-10T21:13:04","Draft","CR",null,"REQ 36"]
["REQ-2018-0061","Resource reservation for public services usecase","Convida","2018-07-11T13:46:45","Draft","CR",null,"REQ 36"]
["REQ-2018-0054","TR-0026_KI_and_Solution_of_V2V_network_interface_switching_management","Huawei (BEI XU)","2018-07-12T07:39:47","Draft","CR",null,"REQ 36"]
["REQ-2018-0062","REQ 36 Allocation Document","Shelby Kiewel, iconectiv, WG1 Chairman","2018-07-13T13:20:32","Draft","AG",null,"REQ 36"]
["REQ-2018-0063","REQ 36 Agenda","Shelby Kiewel, iconectiv, WG1 Chairman","2018-07-13T13:31:15","Draft","AG",null,"REQ 36"]

{"sheet":"ARC","index":5,"n_rows":65,"n_cols":8,"rows_kept":65,"cut":false,"hidden":false,"merged":[]}
["SHORT DOC NB","SHORTNAME","SOURCE","UPLOADED","STATUS","DOC TYPE","VERS","MEETING"]
["ARC-2018-0104","Feature_Catalogue_For_Semantics","Convida","2018-05-13T12:51:49","Draft","CR",null,"ARC 36"]
["ARC-2018-0111","Limitations_of_oneM2M_Requests_Towards_AEs","Convida","2018-05-13T21:37:09","Draft","INC",null,"ARC 36"]
["ARC-2018-0123","content forwarding","KT","2018-05-14T05:56:56","Draft","INC",null,"ARC 36"]
["ARC-2018-0124","content sharing resource forwarding","KT","2018-05-14T05:59:48","Draft","CR",null,"ARC 36"]
["ARC-2018-0115","Session QoS","Convida","2018-05-14T20:14:05","Draft","INC",null,"ARC 36"]
["ARC-2018-0152","CrossResourceSub_updates_R3","Convida","2018-05-22T08:27:13","Draft","CR",null,"ARC 36"]
["ARC-2018-0100R04","Issues_while_designing_IPE","Convida","2018-05-24T14:10:49","Draft","INC",null,"ARC 36"]
["ARC-2018-0173","TS-0014_baseline_v2_1_0","NTT","2018-07-06T07:10:00","Draft","INC",null,"ARC 36"]
["ARC-2018-0173R01","TS-0014_baseline_v2_1_0","NTT","2018-07-06T07:14:00","Draft","INC",null,"ARC 36"]
["ARC-2018-0174","TS-0014_baseline_v3_2_0","NTT","2018-07-06T07:18:34","Draft","INC",null,"ARC 36"]
["ARC-2018-0175","Subscription_NotificationEventType_Blocking_R3","Convida","2018-07-08T12:49:42","Draft","CR",null,"ARC 36"]
["ARC-2018-0176","UE Reachability monitoring","KT","2018-07-09T00:10:59","Draft","CR",null,"ARC 36"]
["ARC-2018-0177","UE Availability after DDN Failure","KT","2018-07-09T00:14:47","Draft","CR",null,"ARC 36"]
["ARC-2018-0178","UE Communication Failure","KT","2018-07-09T00:16:49","Draft","CR",null,"ARC 36"]
["ARC-2018-0179","UE Loss of Connectivity","KT","2018-07-09T00:19:13","Draft","CR",null,"ARC 36"]
["ARC-2018-0180","Detecting Change of IMSI-IMEI(SV) Association","KT","2018-07-09T00:21:39","Draft","CR",null,"ARC 36"]
["ARC-2018-0181","Roaming Status","KT","2018-07-09T00:23:31","Draft","CR",null,"ARC 36"]
["ARC-2018-0182","Location Reporting","KT","2018-07-09T00:26:21","Draft","CR",null,"ARC 36"]
["ARC-2018-0183","Resource Type locationPolicy","KT","2018-07-09T00:28:03","Draft","CR",null,"ARC 36"]
["ARC-2018-0184","check for monitoring events","KT","2018-07-09T00:30:22","Draft","CR",null,"ARC 36"]
["ARC-2018-0185","TS0026-UE_Reachability_monitoring","Huawei (BEI XU)","2018-07-09T01:15:40","Draft","CR",null,"ARC 36"]
["ARC-2018-0186","TS0026_Node_Management","Huawei (BEI XU)","2018-07-09T01:19:16","Draft","CR",null,"ARC 36"]
["ARC-2018-0187","Group_Schedule_solution_discussion","Huawei (BEI XU)","2018-07-09T01:59:18","Draft","INC",null,"ARC 36"]
["ARC-2018-0191","TS-0031_HAIM_related_features","Convida","2018-07-09T03:26:33","Draft","CR",null,"ARC 36"]
["ARC-2018-0192","TS-0026_3GPP_Interworking_Cleanup","Convida","2018-07-09T03:40:33","Draft","CR",null,"ARC 36"]
["ARC-2018-0193","Notificaion Target Discussion","Hyundai Motors","2018-07-09T05:11:43","Draft","INC",null,"ARC 36"]
["ARC-2018-0194","TR-0055-3GPP_V2X_Interworking-V0_2_0","Huawei (BEI XU)","2018-07-09T07:06:35","Draft","CR",null,"ARC 36"]
["ARC-2018-0195","TR-0056_Summary_of_Differences_between _Rel-2A & Rel-3_Skeleton","NTT","2018-07-09T08:14:40","Draft","INC",null,"ARC 36"]
["ARC-2018-0201","TR-0026 multiple registrations key issue","Convida","2018-07-09T19:33:42","Draft","CR",null,"ARC 36"]
["ARC-2018-0202","Edge Fog nomenclature proposal","Convida, KDDI","2018-07-09T19:35:26","Draft","CR",null,"ARC 36"]
["ARC-2018-0203","TR-0052 Edge Fog nomenclature","Convida, KDDI","2018-07-09T19:36:18","Draft","CR",null,"ARC 36"]
["ARC-2018-0196","Data_delivery_optimization_scenario_using_Radio_information_for Edge_Fog_Computing","KDDI","2018-07-09T22:51:35","Draft","INC",null,"ARC 36"]
["ARC-2018-0204","TR-0036-oneTransport_for_Smart_Cities","Convida","2018-07-10T00:41:39","Draft","INC",null,"ARC 36"]
["ARC-2018-0205","New TR-0054 Baseline","Convida","2018-07-10T01:17:57","Draft","INC",null,"ARC 36"]
["ARC-2018-0115R01","Session QoS","Convida","2018-07-10T01:48:35","Draft","INC",null,"ARC 36"]
["ARC-2018-0197","Introduction to The Newly Proposed Access Control Policy","Datang","2018-07-10T02:46:17","Draft","INC",null,"ARC 36"]
["ARC-2018-0198","Introduction to The Newly Proposed Access Control Policy_Example_#1","Datang","2018-07-10T02:47:03","Draft","INC",null,"ARC 36"]
["ARC-2018-0199","Introduction to The Newly Proposed Access Control Policy_Example_#2","Datang","2018-07-10T02:47:18","Draft","INC",null,"ARC 36"]
["ARC-2018-0200","Introduction to The Newly Proposed Access Control Policy_Example_#3","Datang","2018-07-10T02:47:32","Draft","INC",null,"ARC 36"]
["ARC-2018-0195R01","TR-0056_Summary_of_Differences_between _Rel-2A & Rel-3_Skeleton","NTT","2018-07-10T06:32:59","Draft","INC",null,"ARC 36"]
["ARC-2018-0188","TS0001-3GPP_QoS_Resource_structure","Huawei (BEI XU)","2018-07-10T06:34:05","Draft","CR",null,"ARC 36"]
["ARC-2018-0189","TS0026-3GPP_QoS","Huawei (BEI XU)","2018-07-10T06:35:06","Draft","CR",null,"ARC 36"]
["ARC-2018-0206","Action Triggering resources procedures from TR-0021","Convida","2018-07-10T19:41:46","Draft","CR",null,"ARC 36"]
["ARC-2018-0114R03","TS-0001_Cleanup_Authorization","Convida","2018-07-10T21:45:37","Draft","CR",null,"ARC 36"]
["ARC-2018-0138","TR-0036 smart city - introduction","KETI","2018-07-11T08:24:07","Draft","CR",null,"ARC 36"]
["ARC-2018-0201R01","TR-0026 multiple registrations key issue","Convida","2018-07-11T17:54:49","Draft","CR",null,"ARC 36"]
["ARC-2018-0207","Modification_to_Announcement_Description","NTT","2018-07-12T07:50:02","Draft","CR",null,"ARC 36"]
["ARC-2018-0208","TR-0026_KI_and_Solution_of_V2V_network_interface_switching_management","Huawei (BEI XU)","2018-07-12T09:03:15","Draft","CR",null,"ARC 36"]
["ARC-2018-0209","CR_TriggerPayloadSerialization_AttributeRemoval_R3","Convida","2018-07-12T14:00:37","Draft","CR",null,"ARC 36"]
["ARC-2018-0210","CR_TriggerValidityTime_Multiplicity_R3","Convida","2018-07-12T14:02:29","Draft","CR",null,"ARC 36"]
["ARC-2018-0211","CR_Content_Serialization_Response_R3","Convida","2018-07-12T14:04:16","Draft","CR",null,"ARC 36"]
["ARC-2018-0212","CR_Content_Serialization_Response_R2","Convida","2018-07-12T14:06:23","Draft","CR",null,"ARC 36"]
["ARC-2018-0213","CR_Location_Policy_Reports_R4","Convida","2018-07-12T14:09:10","Draft","CR",null,"ARC 36"]
["ARC-2018-0214","CR_LocationPolicy_Parent_R4","Convida","2018-07-12T14:51:47","Draft","CR",null,"ARC 36"]
["ARC-2018-0217","TS-0026_editorial_corrections_of_UE_Attach_with_oneM2M_Registration","KDDI","2018-07-14T14:40:08","Draft","CR",null,"ARC 36"]
["ARC-2018-0217R01","TS-0026_editorial_corrections_of_UE_Attach_with_oneM2M_Registration","KDDI","2018-07-14T14:51:02","Draft","CR",null,"ARC 36"]
["ARC-2018-0218","pollingChannelResponses_R3","Convida","2018-07-15T16:17:08","Draft","CR",null,"ARC 36"]
["ARC-2018-0220","multimediaSession child resource types","KETI","2018-07-15T23:52:45","Draft","CR",null,"ARC 36"]
["ARC-2018-0022R06","TS-0001 editors note cleanup assignment","KETI","2018-07-16T00:08:44","Draft","INC",null,"ARC 36"]
["ARC-2018-0192R01","TS-0026_3GPP_Interworking_Cleanup","Convida","2018-07-16T00:45:25","Draft","CR",null,"ARC 36"]
["ARC-2018-0221","Discussion on Rel-4 TS-0001 Simplification","KETI","2018-07-16T02:45:57","Draft","INC",null,"ARC 36"]
["ARC-2018-0215","ARC36_Document_Allocation","ARC Chair","2018-07-16T12:15:59","Draft","AG",null,"ARC 36"]
["ARC-2018-0216","ARC_36_meeting_agenda","ARC Chair","2018-07-16T12:17:30","Draft","AG",null,"ARC 36"]
["ARC-2018-0190","TS0026-3GPP_MBMS_Group","Huawei (BEI XU)",null,"Draft","CR",null,"ARC 36"]

{"sheet":"PRO","index":6,"n_rows":1,"n_cols":8,"rows_kept":1,"cut":false,"hidden":false,"merged":[]}
["SHORT DOC NB","SHORTNAME","SOURCE","UPLOADED","STATUS","DOC TYPE","VERS","MEETING"]

{"sheet":"SEC","index":7,"n_rows":1,"n_cols":8,"rows_kept":1,"cut":false,"hidden":false,"merged":[]}
["SHORT DOC NB","SHORTNAME","SOURCE","UPLOADED","STATUS","DOC TYPE","VERS","MEETING"]

{"sheet":"MAS","index":8,"n_rows":40,"n_cols":8,"rows_kept":40,"cut":false,"hidden":false,"merged":[]}
["SHORT DOC NB","SHORTNAME","SOURCE","UPLOADED","STATUS","DOC TYPE","VERS","MEETING"]
["MAS-2018-0077R01","WI-0053 Update","Convida","2018-07-02T15:37:18","Agreed","CR",null,"MAS 36"]
["MAS-2018-0081R01","SDT4 change log","Yongjing Zhang (Huawei)","2018-07-03T09:41:51","Draft","CR",null,"MAS 36"]
["MAS-2018-0084","SDT4 JSON","Yongjing Zhang (Huawei)","2018-07-04T03:36:11","Draft","CR",null,"MAS 36"]
["MAS-2018-0085","SDT4 removing Module","Yongjing Zhang (Huawei)","2018-07-04T03:36:21","Draft","CR",null,"MAS 36"]
["MAS-2018-0082","Introducing Product in SDT4","Yongjing Zhang (Huawei)","2018-07-04T03:36:34","Draft","CR",null,"MAS 36"]
["MAS-2018-0095","Algorithm for short names for TS-0023","Andreas Kraft (Deutsche Telekom)","2018-07-06T10:52:46","Draft","CR",null,"MAS 36"]
["MAS-2018-0096","Triggering Continuous Reasoning Process","Convida Wireless","2018-07-07T18:48:36","Noted","INC",null,"MAS 36"]
["MAS-2018-0097","TR-0049_v0.1.0_New_Baseline","Hitachi","2018-07-09T02:05:38","Agreed","CR",null,"MAS 36"]
["MAS-2018-0098","SDT_for_design_of_content_attribute","NTT","2018-07-09T06:53:38","Draft","CR",null,"MAS 36"]
["MAS-2018-0099R01","Adding_a_new_element_to_TS-0023","CMCC, Huawei","2018-07-09T09:31:27","Draft","CR",null,"MAS 36"]
["MAS-2018-0100","Adding_a_few_new_elements_for_DataPoints_of_refrigeration _ModuleClass","CMCC, Huawei","2018-07-09T09:33:43","Draft","CR",null,"MAS 36"]
["MAS-2018-0101","Adding_a_few_new_elements_for_Device_model","CMCC, Huawei","2018-07-09T09:36:57","Draft","CR",null,"MAS 36"]
["MAS-2018-0102","Analysis of industrial domain information models","Hitachi","2018-07-09T10:06:41","Draft","INC",null,"MAS 36"]
["MAS-2018-0094","Smart City model - street light","Yongjing Zhang (Huawei)","2018-07-09T10:58:14","Noted","CR",null,"MAS 36"]
["MAS-2018-0093","Smart City model - air quality monitor","Yongjing Zhang (Huawei), Yawen Niu (CMCC)","2018-07-09T10:59:29","Noted","CR",null,"MAS 36"]
["MAS-2018-0092","Smart City model - water quality monitor","Yongjing Zhang (Huawei)","2018-07-09T11:01:27","Draft","CR",null,"MAS 36"]
["MAS-2018-0091","Smart City model - parking detector","Yongjing Zhang (Huawei)","2018-07-09T11:01:42","Draft","CR",null,"MAS 36"]
["MAS-2018-0090","Smart City model - water meter","Yongjing Zhang (Huawei)","2018-07-09T11:01:55","Draft","CR",null,"MAS 36"]
["MAS-2018-0089","Smart City model - gas meter","Yongjing Zhang (Huawei)","2018-07-09T11:02:06","Noted","CR",null,"MAS 36"]
["MAS-2018-0087","Agenda MAS#36","Yongjing Zhang (Huawei, MAS Chair)","2018-07-09T13:16:14","Noted","AG",null,"MAS 36"]
["MAS-2018-0088","Doc Allocation MAS#36","Yongjing Zhang (Huawei, MAS Chair)","2018-07-09T13:16:26","Noted","AG",null,"MAS 36"]
["MAS-2018-0094R01","Smart City model - street light","Yongjing Zhang (Huawei)","2018-07-10T09:09:14","Noted","CR",null,"MAS 36"]
["MAS-2018-0103","SDT 4.0 鈥?Introducing Enumerations","Andreas Kraft (Deutsche Telekom)","2018-07-10T13:09:53","Draft","CR",null,"MAS 36"]
["MAS-2018-0104","SDT 4.0 鈥?Introducing Referenced DataTypes","Andreas Kraft (Deutsche Telekom)","2018-07-10T13:10:48","Draft","CR",null,"MAS 36"]
["MAS-2018-0098R01","SDT_for_design_of_content_attribute","NTT","2018-07-12T08:13:14","Draft","CR",null,"MAS 36"]
["MAS-2018-0105","Changes in DataPoints tables structure","Orange","2018-07-12T12:04:15","Noted","CR",null,"MAS 36"]
["MAS-2018-0106","Add wifiClient management object to TS-0022","Orange","2018-07-13T10:36:38","Draft","CR",null,"MAS 36"]
["MAS-2018-0107","Assingments of particular Devices to specific domains","Orange","2018-07-13T11:12:42","Draft","CR",null,"MAS 36"]
["MAS-2018-0108","TR-0046-V0_1_0 New baseline","SyncTechno, KETI","2018-07-15T23:50:14","Draft","INC",null,"MAS 36"]
["MAS-2018-0109","Abstract_information_models_for_public_warning_services","SyncTechno, KETI","2018-07-15T23:53:53","Draft","INC",null,"MAS 36"]
["MAS-2018-0110","HAIM_Data_Model_issues","Convida","2018-07-16T12:46:01","Draft","INC",null,"MAS 36"]
["MAS-2018-0087R01","Agenda MAS#36","Yongjing Zhang (Huawei, MAS Chair)","2018-07-16T15:23:10","Agreed","AG",null,"MAS 36"]
["MAS-2018-0088R01","Doc Allocation MAS#36","Yongjing Zhang (Huawei, MAS Chair)","2018-07-16T15:23:44","Noted","AG",null,"MAS 36"]
["MAS-2018-0111","new data types for [wifiClient] management object","Orange","2018-07-16T16:24:11","Draft","CR",null,"MAS 36"]
["MAS-2018-0094R02","Smart City model - street light","Yongjing Zhang (Huawei)","2018-07-16T23:58:01","Draft","CR",null,"MAS 36"]
["MAS-2018-0089R01","Smart City model - gas meter","Yongjing Zhang (Huawei)","2018-07-16T23:58:43","Draft","CR",null,"MAS 36"]
["MAS-2018-0093R01","Smart City model - air quality monitor","Yongjing Zhang (Huawei), Yawen Niu (CMCC)","2018-07-17T00:00:20","Draft","CR",null,"MAS 36"]
["MAS-2018-0099","Adding_a_new_element_to_TS-0023","CMCC, Huawei",null,"Draft","CR",null,"MAS 36"]
["MAS-2018-0083","SDT4 DeviceClass","Yongjing Zhang (Huawei)",null,"Draft","CR",null,"MAS 36"]

{"sheet":"TST","index":9,"n_rows":4,"n_cols":8,"rows_kept":4,"cut":false,"hidden":false,"merged":[]}
["SHORT DOC NB","SHORTNAME","SOURCE","UPLOADED","STATUS","DOC TYPE","VERS","MEETING"]
["TST-2018-0117","TS-0013-Interoperability_Testing-V2_6_0","ETSI","2018-07-02T07:59:59","Draft","INC",null,"TST 36"]
["TST-2018-0118","TR-0051-oneM2M_API_guide-V0_1_0","ETSI","2018-07-02T10:12:47","Draft","INC",null,"TST 36"]
["TST-2018-0119","TS-0018_baseline_v2_5_0","KETI","2018-07-03T01:31:23","Draft","INC",null,"TST 36"]