{"text_format":"1","workbook":"xlsx","n_sheets":10,"sheets":["Document Allocation","logistics","AllDocs","TP","REQ","ARC","PRO","SEC","MAS","TST"],"not_rendered":{"charts":0,"images":1,"macros":1,"external_links":0,"defined_names":31,"comments":0,"pivot_tables":0},"unopened":[],"bounds":{"document_bytes":16777216,"sheet_cells":100000,"rows_first":2000,"rows_last":500,"rows_between":2000,"halvings":0,"cell_chars":16384,"cell_head_chars":4096},"cells_cut":0,"cells_raw":0,"read":"whole","date_system":"1900"}

{"sheet":"Document Allocation","index":0,"n_rows":155,"n_cols":13,"rows_kept":155,"cut":false,"hidden":false,"merged":[]}
["Slot","Room","WG","Doc-Number","Title","Source","Upload Time","WG disposition (Agreed, Noted, Postponed, Withdrawn)","Type (INC, CR, AG, MIN)","Work Item","Rel","Purpose","Notes"]
["Mon-2 (11:00-12:30)",{"$f":"VLOOKUP(A2,logistics!G:I,2,0)","v":2},{"$f":"VLOOKUP(A2,logistics!G:I,3,0)","v":"MAS"},"MAS-2018-0087",{"$f":"VLOOKUP(D2,AllDocs!A:D,2,0)","v":"Agenda MAS#36"},{"$f":"VLOOKUP(D2,AllDocs!A:D,3,0)","v":"Yongjing Zhang (Huawei, MAS Chair)"},{"$f":"VLOOKUP(D2,AllDocs!A:D,4,0)","v":"2018-07-09T13:16:14"},"Noted",{"$f":"VLOOKUP(D2,AllDocs!A:F,6,0)","v":"AG"}]
["Mon-2 (11:00-12:30)",{"$f":"VLOOKUP(A3,logistics!G:I,2,0)","v":2},{"$f":"VLOOKUP(A3,logistics!G:I,3,0)","v":"MAS"},"MAS-2018-0087R01",{"$f":"VLOOKUP(D3,AllDocs!A:D,2,0)","v":"Agenda MAS#36"},{"$f":"VLOOKUP(D3,AllDocs!A:D,3,0)","v":"Yongjing Zhang (Huawei, MAS Chair)"},{"$f":"VLOOKUP(D3,AllDocs!A:D,4,0)","v":"2018-07-16T15:23:10"},"Agreed",{"$f":"VLOOKUP(D3,AllDocs!A:F,6,0)","v":"AG"}]
["Mon-2 (11:00-12:30)",{"$f":"VLOOKUP(A4,logistics!G:I,2,0)","v":2},{"$f":"VLOOKUP(A4,logistics!G:I,3,0)","v":"MAS"},"MAS-2018-0088",{"$f":"VLOOKUP(D4,AllDocs!A:D,2,0)","v":"Doc Allocation MAS#36"},{"$f":"VLOOKUP(D4,AllDocs!A:D,3,0)","v":"Yongjing Zhang (Huawei, MAS Chair)"},{"$f":"VLOOKUP(D4,AllDocs!A:D,4,0)","v":"2018-07-09T13:16:26"},"Noted",{"$f":"VLOOKUP(D4,AllDocs!A:F,6,0)","v":"AG"}]
["Mon-2 (11:00-12:30)",{"$f":"VLOOKUP(A5,logistics!G:I,2,0)","v":2},{"$f":"VLOOKUP(A5,logistics!G:I,3,0)","v":"MAS"},"MAS-2018-0088R01",{"$f":"VLOOKUP(D5,AllDocs!A:D,2,0)","v":"Doc Allocation MAS#36"},{"$f":"VLOOKUP(D5,AllDocs!A:D,3,0)","v":"Yongjing Zhang (Huawei, MAS Chair)"},{"$f":"VLOOKUP(D5,AllDocs!A:D,4,0)","v":"2018-07-16T15:23:44"},"Noted",{"$f":"VLOOKUP(D5,AllDocs!A:F,6,0)","v":"AG"}]
["Mon-2 (11:00-12:30)",{"$f":"VLOOKUP(A6,logistics!G:I,2,0)","v":2},{"$f":"VLOOKUP(A6,logistics!G:I,3,0)","v":"MAS"},"MAS-2018-0077R01",{"$f":"VLOOKUP(D6,AllDocs!A:D,2,0)","v":"WI-0053 Update"},{"$f":"VLOOKUP(D6,AllDocs!A:D,3,0)","v":"Convida"},{"$f":"VLOOKUP(D6,AllDocs!A:D,4,0)","v":"2018-07-02T15:37:18"},"Agreed",{"$f":"VLOOKUP(D6,AllDocs!A:F,6,0)","v":"CR"},"TS-0034 (WI-0053)",null,null,"To be sent to TP for approval."]
["Mon-2 (11:00-12:30)",{"$f":"VLOOKUP(A7,logistics!G:I,2,0)","v":2},{"$f":"VLOOKUP(A7,logistics!G:I,3,0)","v":"MAS"},"MAS-2018-0096",{"$f":"VLOOKUP(D7,AllDocs!A:D,2,0)","v":"Triggering Continuous Reasoning Process"},{"$f":"VLOOKUP(D7,AllDocs!A:D,3,0)","v":"Convida Wireless"},{"$f":"VLOOKUP(D7,AllDocs!A:D,4,0)","v":"2018-07-07T18:48:36"},"Noted",{"$f":"VLOOKUP(D7,AllDocs!A:F,6,0)","v":"INC"},"TR-0033 (WI-0053)",null,null,"Use different term than 'triggering'.\nAlign the text with box scope in step 9.\nrevision expected."]
["Mon-2 (11:00-12:30)",{"$f":"VLOOKUP(A8,logistics!G:I,2,0)","v":2},{"$f":"VLOOKUP(A8,logistics!G:I,3,0)","v":"MAS"},"MAS-2018-0097",{"$f":"VLOOKUP(D8,AllDocs!A:D,2,0)","v":"TR-0049_v0.1.0_New_Baseline"},{"$f":"VLOOKUP(D8,AllDocs!A:D,3,0)","v":"Hitachi"},{"$f":"VLOOKUP(D8,AllDocs!A:D,4,0)","v":"2018-07-09T02:05:38"},"Agreed",{"$f":"VLOOKUP(D8,AllDocs!A:F,6,0)","v":"CR"},"TR-0049 (WI-0075)"]
["Mon-2 (11:00-12:30)",{"$f":"VLOOKUP(A9,logistics!G:I,2,0)","v":2},{"$f":"VLOOKUP(A9,logistics!G:I,3,0)","v":"MAS"},"MAS-2018-0105",{"$f":"VLOOKUP(D9,AllDocs!A:D,2,0)","v":"Changes in DataPoints tables structure"},{"$f":"VLOOKUP(D9,AllDocs!A:D,3,0)","v":"Orange"},{"$f":"VLOOKUP(D9,AllDocs!A:D,4,0)","v":"2018-07-12T12:04:15"},"Noted",{"$f":"VLOOKUP(D9,AllDocs!A:F,6,0)","v":"CR"},"TS-0023 (WI-0084)",4]
["Mon-2 (11:00-12:30)",{"$f":"VLOOKUP(A10,logistics!G:I,2,0)","v":2},{"$f":"VLOOKUP(A10,logistics!G:I,3,0)","v":"MAS"},"MAS-2018-0066R03",{"$f":"VLOOKUP(D10,AllDocs!A:D,2,0)","v":{"$error":"#N/A"}},{"$f":"VLOOKUP(D10,AllDocs!A:D,3,0)","v":{"$error":"#N/A"}},{"$f":"VLOOKUP(D10,AllDocs!A:D,4,0)","v":{"$error":"#N/A"}},"Noted",{"$f":"VLOOKUP(D10,AllDocs!A:F,6,0)","v":{"$error":"#N/A"}}]
["Mon-2 (11:00-12:30)",{"$f":"VLOOKUP(A11,logistics!G:I,2,0)","v":2},{"$f":"VLOOKUP(A11,logistics!G:I,3,0)","v":"MAS"},"MAS-2018-0066R04",{"$f":"VLOOKUP(D11,AllDocs!A:D,2,0)","v":{"$error":"#N/A"}},{"$f":"VLOOKUP(D11,AllDocs!A:D,3,0)","v":{"$error":"#N/A"}},{"$f":"VLOOKUP(D11,AllDocs!A:D,4,0)","v":{"$error":"#N/A"}},"Agreed",{"$f":"VLOOKUP(D11,AllDocs!A:F,6,0)","v":{"$error":"#N/A"}},null,null,null,"Pre-agreed. R04 should refer to the architecture diagrma in TS-0022. R04 would be sent to TP for approval (SEC WG shall be informed, and email approval could be used if necessary)."]
["Mon-4 (16:00-17:30)",{"$f":"VLOOKUP(A12,logistics!G:I,2,0)","v":2},{"$f":"VLOOKUP(A12,logistics!G:I,3,0)","v":"MAS"},"MAS-2018-0094",{"$f":"VLOOKUP(D12,AllDocs!A:D,2,0)","v":"Smart City model - street light"},{"$f":"VLOOKUP(D12,AllDocs!A:D,3,0)","v":"Yongjing Zhang (Huawei)"},{"$f":"VLOOKUP(D12,AllDocs!A:D,4,0)","v":"2018-07-09T10:58:14"},"Noted",{"$f":"VLOOKUP(D12,AllDocs!A:F,6,0)","v":"CR"},"TS-0023 (WI-0084)",4]
["Mon-4 (16:00-17:30)",{"$f":"VLOOKUP(A13,logistics!G:I,2,0)","v":2},{"$f":"VLOOKUP(A13,logistics!G:I,3,0)","v":"MAS"},"MAS-2018-0094R01",{"$f":"VLOOKUP(D13,AllDocs!A:D,2,0)","v":"Smart City model - street light"},{"$f":"VLOOKUP(D13,AllDocs!A:D,3,0)","v":"Yongjing Zhang (Huawei)"},{"$f":"VLOOKUP(D13,AllDocs!A:D,4,0)","v":"2018-07-10T09:09:14"},"Noted",{"$f":"VLOOKUP(D13,AllDocs!A:F,6,0)","v":"CR"},"TS-0023 (WI-0084)",4]
["Mon-4 (16:00-17:30)",{"$f":"VLOOKUP(A14,logistics!G:I,2,0)","v":2},{"$f":"VLOOKUP(A14,logistics!G:I,3,0)","v":"MAS"},"MAS-2018-0094R02",{"$f":"VLOOKUP(D14,AllDocs!A:D,2,0)","v":"Smart City model - street light"},{"$f":"VLOOKUP(D14,AllDocs!A:D,3,0)","v":"Yongjing Zhang (Huawei)"},{"$f":"VLOOKUP(D14,AllDocs!A:D,4,0)","v":"2018-07-16T23:58:01"},"Agreed",{"$f":"VLOOKUP(D14,AllDocs!A:F,6,0)","v":"CR"},"TS-0023 (WI-0084)",4]
["Mon-4 (16:00-17:30)",{"$f":"VLOOKUP(A15,logistics!G:I,2,0)","v":2},{"$f":"VLOOKUP(A15,logistics!G:I,3,0)","v":"MAS"},"MAS-2018-0089",{"$f":"VLOOKUP(D15,AllDocs!A:D,2,0)","v":"Smart City model - gas meter"},{"$f":"VLOOKUP(D15,AllDocs!A:D,3,0)","v":"Yongjing Zhang (Huawei)"},{"$f":"VLOOKUP(D15,AllDocs!A:D,4,0)","v":"2018-07-09T11:02:06"},"Noted",{"$f":"VLOOKUP(D15,AllDocs!A:F,6,0)","v":"CR"},"TS-0023 (WI-0084)",4]
["Mon-4 (16:00-17:30)",{"$f":"VLOOKUP(A16,logistics!G:I,2,0)","v":2},{"$f":"VLOOKUP(A16,logistics!G:I,3,0)","v":"MAS"},"MAS-2018-0089R01",{"$f":"VLOOKUP(D16,AllDocs!A:D,2,0)","v":"Smart City model - gas meter"},{"$f":"VLOOKUP(D16,AllDocs!A:D,3,0)","v":"Yongjing Zhang (Huawei)"},{"$f":"VLOOKUP(D16,AllDocs!A:D,4,0)","v":"2018-07-16T23:58:43"},"Agreed",{"$f":"VLOOKUP(D16,AllDocs!A:F,6,0)","v":"CR"},"TS-0023 (WI-0084)",4]
["Mon-4 (16:00-17:30)",{"$f":"VLOOKUP(A17,logistics!G:I,2,0)","v":2},{"$f":"VLOOKUP(A17,logistics!G:I,3,0)","v":"MAS"},"MAS-2018-0093",{"$f":"VLOOKUP(D17,AllDocs!A:D,2,0)","v":"Smart City model - air quality monitor"},{"$f":"VLOOKUP(D17,AllDocs!A:D,3,0)","v":"Yongjing Zhang (Huawei), Yawen Niu (CMCC)"},{"$f":"VLOOKUP(D17,AllDocs!A:D,4,0)","v":"2018-07-09T10:59:29"},"Noted",{"$f":"VLOOKUP(D17,AllDocs!A:F,6,0)","v":"CR"},"TS-0023 (WI-0084)",4]
["Mon-4 (16:00-17:30)",{"$f":"VLOOKUP(A18,logistics!G:I,2,0)","v":2},{"$f":"VLOOKUP(A18,logistics!G:I,3,0)","v":"MAS"},"MAS-2018-0093R01",{"$f":"VLOOKUP(D18,AllDocs!A:D,2,0)","v":"Smart City model - air quality monitor"},{"$f":"VLOOKUP(D18,AllDocs!A:D,3,0)","v":"Yongjing Zhang (Huawei), Yawen Niu (CMCC)"},{"$f":"VLOOKUP(D18,AllDocs!A:D,4,0)","v":"2018-07-17T00:00:20"},"Agreed",{"$f":"VLOOKUP(D18,AllDocs!A:F,6,0)","v":"CR"},"TS-0023 (WI-0084)",4]
[null,{"$f":"VLOOKUP(A19,logistics!G:I,2,0)","v":{"$error":"#N/A"}},{"$f":"VLOOKUP(A19,logistics!G:I,3,0)","v":{"$error":"#N/A"}},null,{"$f":"VLOOKUP(D19,AllDocs!A:D,2,0)","v":{"$error":"#N/A"}},{"$f":"VLOOKUP(D19,AllDocs!A:D,3,0)","v":{"$error":"#N/A"}},{"$f":"VLOOKUP(D19,AllDocs!A:D,4,0)","v":{"$error":"#N/A"}},null,{"$f":"VLOOKUP(D19,AllDocs!A:F,6,0)","v":{"$error":"#N/A"}}]
["Tue-4 (15:30-17:00)",{"$f":"VLOOKUP(A20,logistics!G:I,2,0)","v":1},{"$f":"VLOOKUP(A20,logistics!G:I,3,0)","v":"REQ/MAS"},"<semantics>",{"$f":"VLOOKUP(D20,AllDocs!A:D,2,0)","v":{"$error":"#N/A"}},{"$f":"VLOOKUP(D20,AllDocs!A:D,3,0)","v":{"$error":"#N/A"}},{"$f":"VLOOKUP(D20,AllDocs!A:D,4,0)","v":{"$error":"#N/A"}},null,{"$f":"VLOOKUP(D20,AllDocs!A:F,6,0)","v":{"$error":"#N/A"}}]
{"$rows_left_out":136}
{"sheet":"logistics","index":1,"n_rows":33,"n_cols":12,"rows_kept":33,"cut":false,"hidden":false,"merged":[]}
["WeekDay","SlotTime","Day","Slot","Time","AllSlots","MAS Slots","Rooms","WGs","WIs","Short Name","Deadline"]
["Mon","9:00-10:30","Mon",1,"9:00-10:30",{"$f":"CONCATENATE(C2,\"-\",D2,\" (\",E2,\")\")","v":"Mon-1 (9:00-10:30)"},{"$f":"IF(COUNTA(I2),CELL(\"contents\",F2),\"\")","v":""},null,null,"TR-0001 (WI-0015)","Use Case Continuation","2018-07-09T13:00:00"]
["Tue","10:30-11:00","Mon",2,"11:00-12:30","Mon-2 (11:00-12:30)",{"$f":"IF(COUNTA(I3),CELL(\"contents\",F3),\"\")","v":"Mon-2 (11:00-12:30)"},2,"MAS","TR-0007 (WI-0053)","Semantic Study"]
["Wed","11:00-12:30","Mon",3,"14:00-15:30",{"$f":"CONCATENATE(C4,\"-\",D4,\" (\",E4,\")\")","v":"Mon-3 (14:00-15:30)"},"",null,null,"TR-0014 (WI-0018)","oneM2M AllJoyn Interworking"]
["Thu","12:30-13:30","Mon",4,"16:00-17:30",{"$f":"CONCATENATE(C5,\"-\",D5,\" (\",E5,\")\")","v":"Mon-4 (16:00-17:30)"},"Mon-4 (16:00-17:30)",2,"MAS","TR-0017 (WI-0017)","Home Domain Abstract Information Model"]
["Fri","13:30-15:00","Mon",5,null,"Mon-5 ()","",null,null,"TR-0018 (WI-0059)","Industry Domain Enablement"]
[null,"15:00-15:30","Tue",1,"9:00-10:30","Tue-1 (9:00-10:30)","",null,null,"TR-0022 (WI-0043)","Continuation & integration of HGI Smart Home activities"]
[null,"15:30-17:00","Tue",2,"11:00-12:30","Tue-2 (10:30-12:00)","",null,null,"TR-0031 (WI-0052)","LWM2M DM Interworking Enhancement"]
[null,"17:00-18:30","Tue",3,"13:30-15:00",{"$f":"CONCATENATE(C9,\"-\",D9,\" (\",E9,\")\")","v":"Tue-3 (13:30-15:00)"},"",null,null,"TR-0033 (WI-0053)","Study on Enhanced Semantic Enablement"]
[null,null,"Tue",4,"15:30-17:00","Tue-4 (15:30-17:00)","Tue-4 (15:30-17:00)",1,"REQ/MAS","TR-0039 (WI-0054)","Developer guide-SDT-based implementation"]
[null,"08:30-10:00","Tue",5,null,"Tue-5 ()","",null,null,"TR-0042 (WI-0071)","WoT Interworking"]
[null,"10:00-10:30","Wed",1,"9:00-10:30","Wed-1 (9:00-10:30)","Wed-1 (9:00-10:30)",2,"MAS","TR-0043 (WI-0072)","Modbus Interworking"]
[null,"10:30-12:00","Wed",2,"11:00-12:30","Wed-2 (11:00-12:30)","Wed-2 (11:00-12:30)",2,"MAS","TR-0045 (WI-0054)","Developer Guide: Implementing Semantics"]
[null,"12:00-13:30","Wed",3,"13:30-15:00","Wed-3 (13:30-15:00)","Wed-3 (13:30-15:00)",1,"ARC/MAS","TR-0046 (WI-0070)","Study on Disaster Alert Service Enabler"]
[null,"13:30-15:00","Wed",4,"15:30-17:00","Wed-4 (15:30-17:00)","Wed-4 (15:30-17:00)",2,"REQ/MAS","TR-0049 (WI-0075)","Industrial Domain Information Model Mapping & Semantics Support"]
[null,"15:00-15:30","Wed",5,null,"Wed-5 ()","",null,null,"TS-0001 (WI-0002)","Architecture"]
[null,"15:30-17:00","Thu",1,"9:00-10:30","Thu-1 (9:00-10:30)","Thu-1 (9:00-10:30)",2,"REQ/MAS","TS-0002 (WI-0001)","Requirement"]
[null,"17:00-18:30","Thu",2,"11:00-12:30","Thu-2 (11:00-12:30)","",null,null,"TS-0004 (WI-0009)","Protocol Core"]
[null,null,"Thu",3,"13:30-15:00","Thu-3 (13:30-15:00)","",null,null,"TS-0005 (WI-0010)","OMA Mapping"]
[null,null,"Thu",4,"15:30-17:00","Thu-4 (15:30-17:00)","Thu-4 (15:30-17:00)",2,"MAS","TS-0006 (WI-0010)","BBF Mapping"]
{"$rows_left_out":14}
{"sheet":"AllDocs","index":2,"n_rows":142,"n_cols":8,"rows_kept":142,"cut":false,"hidden":false,"merged":[]}
["SHORT DOC NB","SHORTNAME","SOURCE","UPLOADED","STATUS","DOC TYPE","VERS","MEETING"]
["TP-2018-0029","oneM2M_ARC_WG_intro_for_ITU-T_joint_meeting","ARC Chair","2018-01-16T21:56:06","Draft","INC",null,"TP 36"]
["TP-2018-0131","Invitation to TP36 WG meetings in Washington DC USA","ATIS","2018-03-19T19:23:13","Noted","INV",null,"TP 36 WGs only"]
["ARC-2018-0104","Feature_Catalogue_For_Semantics","Convida","2018-05-13T12:51:49","Draft","CR",null,"ARC 36"]
["ARC-2018-0111","Limitations_of_oneM2M_Requests_Towards_AEs","Convida","2018-05-13T21:37:09","Draft","INC",null,"ARC 36"]
["ARC-2018-0123","content forwarding","KT","2018-05-14T05:56:56","Draft","INC",null,"ARC 36"]
["ARC-2018-0124","content sharing resource forwarding","KT","2018-05-14T05:59:48","Draft","CR",null,"ARC 36"]
["ARC-2018-0115","Session QoS","Convida","2018-05-14T20:14:05","Draft","INC",null,"ARC 36"]
["ARC-2018-0152","CrossResourceSub_updates_R3","Convida","2018-05-22T08:27:13","Draft","CR",null,"ARC 36"]
["ARC-2018-0100R04","Issues_while_designing_IPE","Convida","2018-05-24T14:10:49","Draft","INC",null,"ARC 36"]
["PRO-2018-0185","TS-0004 Service Layer Core Protocol V2.18.0","TS-0004 Rapporteur (Nobu Uchida)","2018-06-07T07:41:11","Draft","INC",null,"TP 36 WGs only"]
["TP-2018-0196","Voting List TP36","Karen Hughes, Secretariat","2018-06-07T13:05:59","Draft","INC",null,"TP 36 WGs only"]
["PRO-2018-0184","TS-0004 Service Layer Core Protocol V3.8.0","TS-0004 Rapporteur (Nobu Uchida)","2018-06-11T04:54:25","Draft","INC",null,"TP 36 WGs only"]
["TP-2018-0202","Weekly Schedule TP36","Karen Hughes, Secretariat","2018-06-22T08:30:15","Draft","INC",null,"TP 36 WGs only"]
["TP-2018-0202R01","Weekly Schedule TP36","Karen Hughes, Secretariat","2018-06-22T08:54:25","Draft","INC",null,"TP 36 WGs only"]
["TST-2018-0117","TS-0013-Interoperability_Testing-V2_6_0","ETSI","2018-07-02T07:59:59","Draft","INC",null,"TST 36"]
["TST-2018-0118","TR-0051-oneM2M_API_guide-V0_1_0","ETSI","2018-07-02T10:12:47","Draft","INC",null,"TST 36"]
["MAS-2018-0077R01","WI-0053 Update","Convida","2018-07-02T15:37:18","Agreed","CR",null,"MAS 36"]
["TST-2018-0119","TS-0018_baseline_v2_5_0","KETI","2018-07-03T01:31:23","Draft","INC",null,"TST 36"]
["TP-2018-0202R02","Weekly Schedule TP36","Karen Hughes, Secretariat","2018-07-03T08:27:04","Draft","INC",null,"TP 36 WGs only"]
{"$rows_left_out":123}
{"sheet":"TP","index":3,"n_rows":11,"n_cols":8,"rows_kept":11,"cut":false,"hidden":false,"merged":[]}
["SHORT DOC NB","SHORTNAME","SOURCE","UPLOADED","STATUS","DOC TYPE","VERS","MEETING"]
["TP-2018-0029","oneM2M_ARC_WG_intro_for_ITU-T_joint_meeting","ARC Chair","2018-01-16T21:56:06","Draft","INC",null,"TP 36"]
["TP-2018-0131","Invitation to TP36 WG meetings in Washington DC USA","ATIS","2018-03-19T19:23:13","Noted","INV",null,"TP 36 WGs only"]
["PRO-2018-0185","TS-0004 Service Layer Core Protocol V2.18.0","TS-0004 Rapporteur (Nobu Uchida)","2018-06-07T07:41:11","Draft","INC",null,"TP 36 WGs only"]
["TP-2018-0196","Voting List TP36","Karen Hughes, Secretariat","2018-06-07T13:05:59","Draft","INC",null,"TP 36 WGs only"]
["PRO-2018-0184","TS-0004 Service Layer Core Protocol V3.8.0","TS-0004 Rapporteur (Nobu Uchida)","2018-06-11T04:54:25","Draft","INC",null,"TP 36 WGs only"]
["TP-2018-0202","Weekly Schedule TP36","Karen Hughes, Secretariat","2018-06-22T08:30:15","Draft","INC",null,"TP 36 WGs only"]
["TP-2018-0202R01","Weekly Schedule TP36","Karen Hughes, Secretariat","2018-06-22T08:54:25","Draft","INC",null,"TP 36 WGs only"]
["TP-2018-0202R02","Weekly Schedule TP36","Karen Hughes, Secretariat","2018-07-03T08:27:04","Draft","INC",null,"TP 36 WGs only"]
["TP-2018-0203","LS from GCF on oneM2M certification status","GCF","2018-07-04T13:01:21","Draft","LS",null,"TP 36 WGs only"]
["TP-2018-0204","New Broadband Forum Contact and 2019 Meeting Dates","BroadBand Forum","2018-07-04T13:11:18","Draft","LS",null,"TP 36 WGs only"]

{"sheet":"REQ","index":4,"n_rows":24,"n_cols":8,"rows_kept":24,"cut":false,"hidden":false,"merged":[]}
["SHORT DOC NB","SHORTNAME","SOURCE","UPLOADED","STATUS","DOC TYPE","VERS","MEETING"]
["REQ-2018-0043","Use_case_of_Smart_Factories_using_Edge_Fog","KDDI, Hitachi","2018-07-09T00:25:59","Draft","INC",null,"REQ 36"]
["REQ-2018-0044","TS-0002-Requirements-V4_3_0","Huawei (BEI XU)","2018-07-09T01:05:28","Draft","CR",null,"REQ 36"]
["REQ-2018-0044R01","TS-0002-Requirements-V4_3_0","Huawei (BEI XU)","2018-07-09T06:22:32","Draft","CR",null,"REQ 36"]
["REQ-2018-0048","use_case_for_automatic_ontology_mapping","CMCC,Huawei","2018-07-09T08:43:25","Draft","CR",null,"REQ 36"]
["REQ-2018-0049","use_case_for_ontology_mapping_conflict_detection","CMCC, Huawei","2018-07-09T09:08:19","Draft","CR",null,"REQ 36"]
["REQ-2018-0050","use_case_for_ontology_mapping_conflict_repair","CMCC, Huawei","2018-07-09T09:11:46","Draft","CR",null,"REQ 36"]
["REQ-2018-0051","Requirement_for_automatic_ontology_mapping_Use_case","CMCC, Huawei","2018-07-09T09:16:49","Draft","CR",null,"REQ 36"]
["REQ-2018-0052","Requirement_for_ ontology_mapping_conflict_detection _Use_case","CMCC, Huawei","2018-07-09T09:19:46","Draft","CR",null,"REQ 36"]
["REQ-2018-0053","Requirement_for_ ontology_mapping_conflict_repair _Use_case","CMCC, Huawei","2018-07-09T09:21:48","Draft","CR",null,"REQ 36"]
["REQ-2018-0048R01","use_case_for_automatic_ontology_mapping","CMCC,Huawei","2018-07-09T09:23:14","Draft","CR",null,"REQ 36"]
["REQ-2018-0045","Potential automotive Use Cases for Edge/Fog Computing","Hyundai Motor","2018-07-09T09:52:39","Draft","INC",null,"REQ 36"]
["REQ-2018-0046","Discussion on Vulnerable Road User Discovery Use Case","Hyundai Motor","2018-07-09T09:53:57","Draft","INC",null,"REQ 36"]
["REQ-2018-0047","Vulnerable Road User Discovery Use Case for Edge/Fog Computing","Hyundai Motor","2018-07-09T10:45:07","Draft","INC",null,"REQ 36"]
["REQ-2018-0055","use case for semantic query and discovery based on ontology mapping","Yongjing Zhang (Huawei), Yawen Niu (CMCC)","2018-07-09T11:12:35","Draft","CR",null,"REQ 36"]
["REQ-2018-0056","use case for semantic control based on ontology mapping.","Yongjing Zhang (Huawei), Yawen Niu (CMCC)","2018-07-09T11:12:51","Draft","CR",null,"REQ 36"]
["REQ-2018-0057","TS-0002 Requirements for semantic query and discovery based on ontology mapping","Yongjing Zhang (Huawei), Yawen Niu (CMCC)","2018-07-09T11:13:02","Draft","CR",null,"REQ 36"]
["REQ-2018-0058","TS-0002 Requirements for semantic control based on ontology mapping","Yongjing Zhang (Huawei), Yawen Niu (CMCC)","2018-07-09T11:13:12","Draft","CR",null,"REQ 36"]
["REQ-2018-0060","Lightweight services TS-0002 requirements","Convida","2018-07-10T21:12:23","Draft","CR",null,"REQ 36"]
["REQ-2018-0059","Service subscriber TS-0002 requirements","Convida","2018-07-10T21:13:04","Draft","CR",null,"REQ 36"]
{"$rows_left_out":5}
{"sheet":"ARC","index":5,"n_rows":65,"n_cols":8,"rows_kept":65,"cut":false,"hidden":false,"merged":[]}
["SHORT DOC NB","SHORTNAME","SOURCE","UPLOADED","STATUS","DOC TYPE","VERS","MEETING"]
["ARC-2018-0104","Feature_Catalogue_For_Semantics","Convida","2018-05-13T12:51:49","Draft","CR",null,"ARC 36"]
["ARC-2018-0111","Limitations_of_oneM2M_Requests_Towards_AEs","Convida","2018-05-13T21:37:09","Draft","INC",null,"ARC 36"]
["ARC-2018-0123","content forwarding","KT","2018-05-14T05:56:56","Draft","INC",null,"ARC 36"]
["ARC-2018-0124","content sharing resource forwarding","KT","2018-05-14T05:59:48","Draft","CR",null,"ARC 36"]
["ARC-2018-0115","Session QoS","Convida","2018-05-14T20:14:05","Draft","INC",null,"ARC 36"]
["ARC-2018-0152","CrossResourceSub_updates_R3","Convida","2018-05-22T08:27:13","Draft","CR",null,"ARC 36"]
["ARC-2018-0100R04","Issues_while_designing_IPE","Convida","2018-05-24T14:10:49","Draft","INC",null,"ARC 36"]
["ARC-2018-0173","TS-0014_baseline_v2_1_0","NTT","2018-07-06T07:10:00","Draft","INC",null,"ARC 36"]
["ARC-2018-0173R01","TS-0014_baseline_v2_1_0","NTT","2018-07-06T07:14:00","Draft","INC",null,"ARC 36"]
["ARC-2018-0174","TS-0014_baseline_v3_2_0","NTT","2018-07-06T07:18:34","Draft","INC",null,"ARC 36"]
["ARC-2018-0175","Subscription_NotificationEventType_Blocking_R3","Convida","2018-07-08T12:49:42","Draft","CR",null,"ARC 36"]
["ARC-2018-0176","UE Reachability monitoring","KT","2018-07-09T00:10:59","Draft","CR",null,"ARC 36"]
["ARC-2018-0177","UE Availability after DDN Failure","KT","2018-07-09T00:14:47","Draft","CR",null,"ARC 36"]
["ARC-2018-0178","UE Communication Failure","KT","2018-07-09T00:16:49","Draft","CR",null,"ARC 36"]
["ARC-2018-0179","UE Loss of Connectivity","KT","2018-07-09T00:19:13","Draft","CR",null,"ARC 36"]
["ARC-2018-0180","Detecting Change of IMSI-IMEI(SV) Association","KT","2018-07-09T00:21:39","Draft","CR",null,"ARC 36"]
["ARC-2018-0181","Roaming Status","KT","2018-07-09T00:23:31","Draft","CR",null,"ARC 36"]
["ARC-2018-0182","Location Reporting","KT","2018-07-09T00:26:21","Draft","CR",null,"ARC 36"]
["ARC-2018-0183","Resource Type locationPolicy","KT","2018-07-09T00:28:03","Draft","CR",null,"ARC 36"]
{"$rows_left_out":46}
{"sheet":"PRO","index":6,"n_rows":1,"n_cols":8,"rows_kept":1,"cut":false,"hidden":false,"merged":[]}
["SHORT DOC NB","SHORTNAME","SOURCE","UPLOADED","STATUS","DOC TYPE","VERS","MEETING"]

{"sheet":"SEC","index":7,"n_rows":1,"n_cols":8,"rows_kept":1,"cut":false,"hidden":false,"merged":[]}
["SHORT DOC NB","SHORTNAME","SOURCE","UPLOADED","STATUS","DOC TYPE","VERS","MEETING"]

{"sheet":"MAS","index":8,"n_rows":40,"n_cols":8,"rows_kept":40,"cut":false,"hidden":false,"merged":[]}
["SHORT DOC NB","SHORTNAME","SOURCE","UPLOADED","STATUS","DOC TYPE","VERS","MEETING"]
["MAS-2018-0077R01","WI-0053 Update","Convida","2018-07-02T15:37:18","Agreed","CR",null,"MAS 36"]
["MAS-2018-0081R01","SDT4 change log","Yongjing Zhang (Huawei)","2018-07-03T09:41:51","Draft","CR",null,"MAS 36"]
["MAS-2018-0084","SDT4 JSON","Yongjing Zhang (Huawei)","2018-07-04T03:36:11","Draft","CR",null,"MAS 36"]
["MAS-2018-0085","SDT4 removing Module","Yongjing Zhang (Huawei)","2018-07-04T03:36:21","Draft","CR",null,"MAS 36"]
["MAS-2018-0082","Introducing Product in SDT4","Yongjing Zhang (Huawei)","2018-07-04T03:36:34","Draft","CR",null,"MAS 36"]
["MAS-2018-0095","Algorithm for short names for TS-0023","Andreas Kraft (Deutsche Telekom)","2018-07-06T10:52:46","Draft","CR",null,"MAS 36"]
["MAS-2018-0096","Triggering Continuous Reasoning Process","Convida Wireless","2018-07-07T18:48:36","Noted","INC",null,"MAS 36"]
["MAS-2018-0097","TR-0049_v0.1.0_New_Baseline","Hitachi","2018-07-09T02:05:38","Agreed","CR",null,"MAS 36"]
["MAS-2018-0098","SDT_for_design_of_content_attribute","NTT","2018-07-09T06:53:38","Draft","CR",null,"MAS 36"]
["MAS-2018-0099R01","Adding_a_new_element_to_TS-0023","CMCC, Huawei","2018-07-09T09:31:27","Draft","CR",null,"MAS 36"]
["MAS-2018-0100","Adding_a_few_new_elements_for_DataPoints_of_refrigeration _ModuleClass","CMCC, Huawei","2018-07-09T09:33:43","Draft","CR",null,"MAS 36"]
["MAS-2018-0101","Adding_a_few_new_elements_for_Device_model","CMCC, Huawei","2018-07-09T09:36:57","Draft","CR",null,"MAS 36"]
["MAS-2018-0102","Analysis of industrial domain information models","Hitachi","2018-07-09T10:06:41","Draft","INC",null,"MAS 36"]
["MAS-2018-0094","Smart City model - street light","Yongjing Zhang (Huawei)","2018-07-09T10:58:14","Noted","CR",null,"MAS 36"]
["MAS-2018-0093","Smart City model - air quality monitor","Yongjing Zhang (Huawei), Yawen Niu (CMCC)","2018-07-09T10:59:29","Noted","CR",null,"MAS 36"]
["MAS-2018-0092","Smart City model - water quality monitor","Yongjing Zhang (Huawei)","2018-07-09T11:01:27","Draft","CR",null,"MAS 36"]
["MAS-2018-0091","Smart City model - parking detector","Yongjing Zhang (Huawei)","2018-07-09T11:01:42","Draft","CR",null,"MAS 36"]
["MAS-2018-0090","Smart City model - water meter","Yongjing Zhang (Huawei)","2018-07-09T11:01:55","Draft","CR",null,"MAS 36"]
["MAS-2018-0089","Smart City model - gas meter","Yongjing Zhang (Huawei)","2018-07-09T11:02:06","Noted","CR",null,"MAS 36"]
{"$rows_left_out":21}
{"sheet":"TST","index":9,"n_rows":4,"n_cols":8,"rows_kept":4,"cut":false,"hidden":false,"merged":[]}
["SHORT DOC NB","SHORTNAME","SOURCE","UPLOADED","STATUS","DOC TYPE","VERS","MEETING"]
["TST-2018-0117","TS-0013-Interoperability_Testing-V2_6_0","ETSI","2018-07-02T07:59:59","Draft","INC",null,"TST 36"]
["TST-2018-0118","TR-0051-oneM2M_API_guide-V0_1_0","ETSI","2018-07-02T10:12:47","Draft","INC",null,"TST 36"]
["TST-2018-0119","TS-0018_baseline_v2_5_0","KETI","2018-07-03T01:31:23","Draft","INC",null,"TST 36"]